##TITLE= 1D WINNMR
##JCAMPDX= 5.0
##DATA TYPE= NMR SPECTRUM
##DATA CLASS= NTUPLES
##ORIGIN= 1D WINNMR
##OWNER= guest
##.OBSERVE FREQUENCY= 200.13574758
##.OBSERVE NUCLEUS= ^1H
##.ACQUISITION MODE= SEQUENTIAL
##.AVERAGES= 32
##SPECTROMETER/DATA SYSTEM= A3000
$$ BRUKER SPECIFIC PARAMETERS
##$AQ_mod= 2
##$BF1= 200.131373
##$BF2= 100.000000
##$FMFLAG= 0
##$FW= 3500.000000
##$INSTRUM= <AM>
##$NS= 32
##$NUCLEUS= <>
##$O1= 4374.178924
##$O2= 1100.000000
##$SFO1= 200.135748
##$SOLVENT= <>
##$SW= 13.957076
##$SW_h= 2793.296089
##$TD= 16384
##$YMAX_a= -1.000000
##$YMIN_a= 0.000000
##$FT_mod= 0
##$NC_proc= 0
##$OFFSET= 401 
##$SF= 200.134755
##$SI= 8192
##$SW_p= 2793.296089
##$XDIM= 8192
##$YMIN_p= -332.428619
##$YMAX_p= 40557.644531
$$ END OF BRUKER SPECIFIC PARAMETERS
$$ BRUKER SPECIFIC PLT PARAMETERS
$$#TITLE= Parameter file,  UXNMR
$$#$Height= 10.000000
$$#$Width= 20.00
$$#$XOffset= 1.00
$$#$YOffset= 1.000000
$$#$Start= 0.00
$$#$Stop= 100.00
$$#$Offset= 0.000000
$$#$YScale= 24.498800
$$#$SR= 3381.931330
$$#$vay= 10017.577148
$$#$vby= 0.000000
$$#$vay_p= 10000.00
$$#$vby_p= 0.00
$$#$ppm_cm= 5.00
$$#$Hz_cm= 500.00
$$#$YVal_cm= 1001.757690
$$#$xstart= 0
$$#$xstop= 128
$$#$xstart_p= 0
$$#$xstop_p= 0
$$#$NC_proc= 0
$$#$BaseInt= 100.0
$$#$NormInt= 1.0
$$#$DecoFct= 10000.00
$$#$Rec= 0
$$#$MPSF= 1.0
$$#$AQ_time= 2.932701
$$#$NUCLEUS= <?>
$$#END= 
$$ END OF BRUKER SPECIFIC PLT PARAMETERS
$$ BRUKER SPECIFIC TITLE
$$PLOTTER TEST WATTANABE DRUM / 09.11.1990
$$ END OF BRUKER SPECIFIC TITLE
$$ BRUKER SPECIFIC A3000 PARAMETERS
$$#TITLE= Parameter file
$$#$PARSET= <0x500002>
$$#$PROGRAM= <DisNMR>
$$#$NM= <RLODCB.001>
$$#$OPERATOR= <>
$$#$ASIZE= 16384
$$#$GLOBEX= 0
$$#$SWPCOM= 32
$$#$TDSIZE= 16384
$$#$DWELLT= 179.00
$$#$FWIDTH= 3500
$$#$VDELAY= 0
$$#$DSCANS= 2
$$#$SPWIDTH= 2793.296
$$#$AQMODE= 0
$$#$TEXP= 0
$$#$O1= 4374.179
$$#$O2= 1100.000
$$#$PH0C= 0
$$#$PH1C= 0
$$#$TOTLB= 0.000
$$#$NTHPT= 0.000
$$#$CRDEL= 0.000
$$#$CPULSE= 8.000
$$#$CDELAY= 226.300
$$#$NS= 32
$$#$DRSTR= 12
$$#$DREND= 6
$$#$DRSET= 12
$$#$CSPDEL= 15
$$#$PHZFLG= 0
$$#$ORIGPS= 0
$$#$SFREQ= 200.13337341
$$#$QUAFLG= <0x1 QN>
$$#$DCTRLW= 2097152
$$#$DATTEN= -63
$$#$DEUTL= 0
$$#$HARFLG= <0x120 PO QP QN>
$$#$PAPS= -1
$$#$TEMPER= 297
$$#$DATASTAT= <0x21 QUAD>
$$#$CPCUR= 20483
$$#$RGAIN_AC= 16
$$#$RGAIN_AM= 1
$$#$SYNCW1= 0
$$#$SYNCW2= 2
$$#$NUCNM1= <>
$$#$NUCNM2= <>
$$#$CAQT= 0
$$#$PD0INC= 0.000
$$#$PARSET= <0x500002>
$$#$FX1= 200.130
$$#$FX2= 200.130
$$#$DFXI= 0
$$#$SAUNM= <AUP1.>
$$#$F1CW= 0
$$#$F2CW= 0
$$#$DUR= (0..9)
$$200.000 200.000 200.000 200.000 200.000 200.000 200.000 200.000 200.000 
$$200.000 
$$#$DPS= (0..9)
$$-63 -63 -63 -63 -63 -63 -63 -63 -63 -63 
$$#$PLSW= (0..9)
$$5.000 50.000 5.000 5.000 5.000 5.000 5.000 5.000 5.000 5.000 
$$#$D9VAR= 50
$$#$ROFREQ= 20
$$#$FMFLAG= 0
$$#$FIXFLG= 0
$$#$DDATE= <1997/Aug/29>
$$#$ATIME= <16:47:44>
$$#$TWODFLG= 0
$$#$OFFSET= 977.531
$$#$SR= 2000.000
$$#$IDSCALE= 1
$$#$INTSCL= 0.000
$$#$SVTHTA= 0
$$#$SVADDI= 0
$$#$MI= 0
$$#$PPSIGN= 0
$$#$PCONS= 1.000
$$#$YMAX= -1
$$#$AIFLAG= 0
$$#$AINORM= 0
$$#$FP0K= 0.000
$$#$FP1K= 0.000
$$#$LB= 0.000
$$#$GB= 0.000
$$#$WTTYPE= <C>
$$#$SBSHFT= 0
$$#$NZP= 0
$$#$T1PT= 0
$$#$T2PT= 0
$$#$SMCTR= 0
$$#$GAMMA= 0.000
$$#$ALPHA= 0.000
$$#$DCON= 1.000
$$#$T1CONF= 0.000
$$#$T1DRIFT= 5
$$#$NE= 1
$$#$NFIDS= 0
$$#$PLOHEI= 25.000
$$#END=
$$ END OF BRUKER SPECIFIC A3000 PARAMETERS
##NTUPLES= NMR SPECTRUM
##VAR_NAME=  FREQUENCY,     SPECTRUM/REAL,   SPECTRUM/IMAG,   PAGE NUMBER
##SYMBOL=    X,             R,               I,               N
##VAR_TYPE=  INDEPENDENT,   DEPENDENT,       DEPENDENT,       PAGE
##VAR_FORM=  AFFN,          ASDF,            ASDF,            AFFN
##VAR_DIM=   8192,          8192,            8192,            2
##UNITS=     HZ,            ARBITRARY UNITS, ARBITRARY UNITS,
##FIRST=     2793.296,      0.00000000,      0.00000000,      1
##LAST=      0.000,         0.00000000,      0.00000000,      2
##MIN=       0.000,         -332.42861938,   -332.42861938,   1
##MAX=       2793.296,      40557,           40557,           2
##FACTOR=    0.3410201550,  1.0000000000,    1.0000000000,    1
##PAGE= N=1
##DATA TABLE=(X++(R..R)), XYDATA
8191 D7m9jNOj9RjLmoPKLMj4oJ8j7PJT%olJ3MnJj2J0j7MQpJ9j3j0TJ0J2j3PKmJ2KJ4Ok2J4Mk
8139 A4j5lqkJ4rNj0J6j3JTpPqPNj6K0%j1J1lnJ8k3Pj1%J3j8J6J2j0J%Jj1Pkj1RJ5nj2OnjJJ3
8089 Ak8K1MPj4Nj2RJQoKnJ0j8J5mQl4L0j5J7k2NJMTJ1noLNj0KkqLmJ7Lk3MJ7p%qoLJ3nRjoJQ
8034 Bj7QkpJ3JKmOj9J9qNj0J0oqJNlLrOP%lklJ3j8RJ1l3L1kk1K1JoPj4Pj9J6K5rojj2lk6M7
7982 Ej5%rJ1nkn%m2Q3k8j0kmPLk0K2nn6J85j88P5j3LqO7j84J90o4nJ3Tj9l1K8k2M8k8n8R0j6
7940 Dnj0%J0%k2OJ9qTK0%k5rK9Qk0mTJ9nTLnKljJ0olKLnmJ5j0NjTnmPQj9QNlMrKQnpJ9rj5J3
7883 a1k%k0K4pj5J1pK6kPl1J7J1poK6j8o6N2L5l6j0J0k2L9k2K4k6Kj8Pmj0ok0R0q8M6L4Kok6
7840 b3k4M0n4J10j30K9N0j1qj0q4L23l54J52Oj7J0j1Mk0k8R0l7m1P2l4Okk4L8j1j9j0K9J7k2
$$ plain form
8191 47 -2 -3 2 8 -11 -2 -3 0 -4 -10 -3 -1 2 6 -8 -14 4 -13 -6 -5 -4 -4 -10 -13 0 4 -1 0 -12 -2 -19 -15 -7 -14 5 -8 -18 -28 -18 -6 -19 -12 -10 -14 -2 0 14 20 -2 12 16 14
8139 14 -1 -4 -12 -14 0 -9 -4 -14 2 -11 -10 -9 -16 -9 -17 -10 -5 -21 -1 -1 -12 -1 -4 -9 9 -14 -7 -18 -18 -5 -23 -7 5 -5 -4 -4 -3 -14 -7 -9 -20 -11 4 -1 -13 -7 -12 -13 -12 1
8089 1 -27 -6 -2 5 -9 -4 -16 -7 -6 2 -4 -2 -7 3 -15 0 -4 4 -30 0 -15 2 -20 -15 -14 -10 -6 5 0 -6 -3 2 -8 -6 -8 -16 -13 -17 0 3 -20 -16 1 -6 -6 -14 -20 -17 -4 -9 0 -1 -7 -6 2
8034 2 -15 -7 -9 -16 -3 -2 0 -4 2 -17 2 -6 -1 -11 -1 -7 -15 -14 -9 -12 -9 -18 -12 -5 -5 -8 -10 -13 0 -18 -9 2 -31 0 -2 -23 -2 -1 -7 0 -14 -7 -26 -10 15 6 0 -1 -13 -16 -42 5
7982 5 -10 -10 -19 -8 -13 -15 -20 -20 -62 21 -7 -17 -19 -23 -16 -13 -33 -11 -16 -72 113 -75 0 -13 -10 -18 49 -135 55 -9 -14 -1 12 -7 -38 -10 -32 16 -12 -70 20 4
7940 4 -1 -11 -11 -1 -1 -23 -17 2 -6 -14 6 6 -19 -28 1 9 -11 -15 -19 0 -5 -10 -7 -12 -10 -13 -14 -4 -10 -13 -11 -8 -13 -17 -2 -12 -7 -8 -9 -14 -18 -11 -3 -22 -14 -9 -12 -8 -17 -15 -7 -12 -19 0 -9 -24 -11
7883 -11 -13 -13 -33 -9 -16 -31 -20 -27 -1 -3 4 -27 -10 1 -6 -12 14 -4 -70 -18 17 -19 -29 -19 -41 -2 -24 0 -26 -24 -42 -35 -39 -49 -55 -75 15 -73 -27 7 9 3 -23
7840 -23 -47 -7 -61 49 -81 -52 -2 -13 -21 -31 -115 208 -146 6 12 -5 5 -6 -2 -22 -50 40 3 -38 34 0 6 4 -20 18 7 -12 -22 7 24 2
7804 Blonj8L4Pk3LQqJrJ6j0nK1Oj7QlrJ2j3QoNLjkMKk%Nj1OjOj8LMnJ1%Ok1QP%mT%TQ%j0ROq
7745 cJ1nqLqOjmO%rlLpNJ7j6RJKJmRk4kK7J0k1%oj0TN6k6j4NlJ2j0Pnl2J6L4k6%NmJ4k4K4j6
7693 a8PpQJ0j6pJ6k1J4J5k0nK0oqRnNpJ1j6J0J1k2K0onlMJ5j9KJ9j3K%j2OTrJJ1lnNj1oJ4n
7644 a4J1rOopQJPj3K1j3KTkj2rRJ0KnkNLj8Ql%k%lNJ4Jj6j0J8JkmNj4K3Kk9J5qJ2lJkJlMpnQ
7588 a6Lj1J5lJPkj2Pj6L5j6%KNj0j5OnJ5J4j4%l5L2J6j2oJ3j4j5K4njONTlpN7p0l9L0J5J1Km
7541 erMNK3k9oMQj5QJ7l0j6J1LL2pj0Nj4KMkTNkJj1J3J0%j4jJ2onMoj1J0J4knPQknpkrQNK%l
7486 a1Rj0Lj3kJ3rK0j3MPJj2qQlpJ0%OpNj0lJPTnTNMLmpj2K2pjOjTkj9K2mTJ2mKpqJ1J4ol0M
7430 b9J6oJ7n%nJ0J3k0m6M8j2nmJ3NoJ6orQPqj7LK9k8OTrRLlKj0K0j3pPkMkmnJ3Kpj0J3Pj7l
$$ plain form
7804 2 -1 -7 -12 -30 4 11 -12 -9 -1 -9 -8 -17 -1 -11 -16 5 11 -6 2 -1 -10 2 -11 -3 -9 -4 -1 -2 -4 0 2 0 0 5 -6 0 -1 5 -13 -10 -6 -11 0 0 6 -15 -7 0 0 -4 -8 -8 -8 0 0 -10 -1 5 -3
7745 -3 8 3 -5 -2 -10 -4 -5 -9 -3 -3 -12 -15 -12 -19 -14 3 -13 -4 -3 -1 0 -4 5 -19 -21 6 16 -5 -5 -11 -21 -31 25 -1 -15 -10 -13 -1 -11 -4 -9 -41 -25 9 -17 -17 -12 -16 -2 -26 -2 -18
7693 -18 -11 -18 -10 0 -16 -23 -7 -28 -14 1 -19 -24 -4 -10 -18 -9 -14 -9 -16 -5 -21 -11 0 -22 -2 -8 -13 -16 -12 3 -16 -14 5 -8 -6 -6 -18 -12 -6 -15 -14 -3 -6 -11 -6 -17 -23 -9 -14
7644 -14 -3 -12 -6 -12 -19 -11 -10 -3 -16 5 -8 -6 -4 -6 -18 -27 -18 -8 -6 -11 -13 -8 -5 -23 -15 -18 -18 -20 -20 -23 -18 -4 -3 -19 -29 -11 -10 -12 -16 -11 -25 -2 0 -29 -14 -22 -10 -13 -12 -14 -13 -16 -12 -19 -24 -16
7588 -16 -13 -24 -9 -12 -11 -4 -6 -18 -11 -27 8 -8 -8 -6 -1 -11 -26 -20 -25 -10 4 -10 -10 -45 -13 3 -9 -15 -2 -16 -31 -7 -12 -13 -7 -2 3 0 -7 50 -20 -59 -29 -14 -3 -1 -5
7541 -5 -14 -10 -5 18 -11 -17 -13 -5 -20 -12 5 -25 -41 -30 -27 5 -2 -12 -7 -21 -19 -15 -17 -19 -14 -16 -15 -26 -13 -3 -3 -17 -18 -6 -12 -17 -13 -19 -30 -20 -6 -8 -13 -6 2 0 -5 -12 -14 -23 -15 -10 -8 -8 -11
7486 -11 -2 -12 -9 -22 -24 -11 -20 0 -13 -9 -2 -1 -13 -21 -13 -16 -23 -13 -13 -7 -14 -9 -19 -22 -21 -14 -7 -12 -17 -12 -8 -5 -9 -16 -28 -6 -13 -14 -8 -9 -10 -12 -31 -9 -13 -17 -5 -9 -7 -14 -22 -11 3 -3 -33 -29
7430 -29 -13 -19 -2 -7 -7 -12 -2 11 -9 -55 -7 -19 -24 -28 -15 -10 -16 0 -6 -15 -7 0 -8 -25 -22 7 -21 -15 -9 -18 -9 -6 -9 -7 -17 3 -10 -17 -10 -12 -8 -10 -14 -19 -6 -4 -11 -21 -8 -1 -18 -21
7378 b1O%lJMOnOpmNlMj0NnqJ3lJ2qlJP%koLT%KNojJ%OlTjqMJJ2Qnj3j2J1OnjmJJ2mLj2J2j1T
7317 b8J7nmJLRj0kMj1JJ3J2k0QrmOJj3qK5RrLkjlPpmNj0L0k5%OkrMJ4nlJ%MOj0rQJ2j1j4J4r
7262 b4J0pJ2k%n%kpnJ3j0J5nKpkJ5j0nMJNjpnNjKlJTJ4poNj3P%J1Jo%J8Lj6pJj6J2J4Oj6NPj
7206 fj9J6mj8J0J3Qj0rOkJOj3KjJ1lj9J3nTJ4NnTrJ8j5RMj5PJ3Nj3njj1J8j1J2k0K3j2J4j2k
7158 b2QJ3j7mNKOj2MJ4k1jJ2mkmNmjOJ2j7LJ0rQOqknMoLnJ4J0j5Rq%j0J2kLJj4LQkQj3rPJJ1
7103 ikpKOokKmj5J3QNj4mJ0n%PJoNOnj0KlpNJ3J4j5lOloMm%lJ2Lk1RoJ2Oqj1PljQj2OPmPJ3
7045 @k5J6mLomJ1qj4LJ7kJ3j7Mj2PMpJKJmJ9j5OQrpqKk7J9LPJTj5J6mKJ7pRj1oJNLj3J2j6J8
6992 a0jj0jLJ%nPJ0j6Qj1mLJ0qJJ2Lj0%kloJJ3%nMjmKTjoT%J5qQnj3J2J1qKj2jJ5JoLoKjQkQ
$$ plain form
7378 -21 -15 -15 -18 -17 -13 -7 -12 -6 -13 -17 -12 -15 -11 -21 -16 -21 -29 -16 -19 -7 -15 -18 -17 -10 -10 -12 -18 -15 -12 -12 -10 -5 -11 -12 -11 -11 -5 -8 -11 -12 -20 -16 -15 -3 5 0 -13 -25 -14 -8 -13 -14 -18 -17 -5 -9 -6 -18 -6 -17 -28
7317 -28 -11 -16 -20 -19 -16 -7 -17 -19 -15 -26 -25 -12 0 -20 -12 -21 -25 -19 -18 -31 -39 -14 -5 -14 -11 -13 -14 -17 -10 -17 -21 -16 -26 4 -21 -21 -15 -17 -26 -22 -8 -13 -16 -15 -15 -11 -5 -15 -24 -16 -4 -15 -29 -15 -24
7262 -24 -14 -21 -9 -11 -11 -16 -16 -18 -25 -30 -17 -27 -12 -17 -15 -22 -24 -9 -19 -24 -20 -19 -14 -15 -22 -27 -22 -23 -21 -24 -23 -22 -8 -15 -21 -16 -29 -22 -22 -11 -10 -16 -16 2 5 -11 -18 -17 -33 -21 -7 -1 -17 -12 -5 -6
7206 -6 -25 -9 -13 -31 -21 -8 0 -10 -19 -13 -15 -14 -8 -21 -19 -20 -9 -12 -31 -18 -23 -28 -14 -9 -14 -19 -28 -10 -25 -16 -12 -27 -20 -7 -2 -15 -20 -21 -32 -14 -25 -13 -33 -10 -22 -8 -20 -22
7158 -22 -14 -1 -18 -22 -17 -15 -9 -21 -17 -3 -24 -25 -13 -17 -19 -23 -18 -22 -23 -17 -5 -22 -19 -9 -18 -10 -4 -12 -14 -19 -15 -21 -18 -23 -9 1 -14 -5 -13 -13 -23 -11 -13 -10 -9 -23 -20 -12 -14 -6 -19 -28 -21 -20 -9
7103 -9 -11 -18 -16 -10 -16 -18 -16 -20 -35 -22 -14 -9 -23 -27 -17 -22 -22 -15 -14 -20 -15 -9 -14 -24 -22 -25 -32 -27 -14 0 -15 -18 -12 -15 -21 -17 -21 -21 -24 -12 -9 -30 -21 -27 -15 -9 -17 -28 -21 -24 -25 -17 -29 -23 -16 -20 -13 0
7045 0 -25 -9 -13 -10 -16 -20 -9 -17 -31 -28 -11 -13 0 -17 -13 -25 -18 -14 -21 -20 -18 -17 -21 -2 -17 -11 -3 -12 -19 -27 -25 -52 -33 -30 -23 -22 -21 -36 -20 -24 -22 -5 -12 -3 -14 -20 -19 -14 -11 -24 -12 -28 -10
6992 -10 -11 -21 -22 -19 -18 -18 -23 -16 -6 -22 -14 -25 -29 -26 -16 -24 -23 -11 -8 -18 -18 -20 -23 -29 -28 -15 -15 -20 -16 -17 -21 -19 -17 -18 -24 -30 -30 -15 -23 -15 -20 -33 -21 -10 -18 -16 -28 -29 -14 -13 -19 -16 -22 -20 -21 -13 -15 -7
6934 gkopOJ2k8J7Rj5nJJ6njrPlTMnMoP%j6K7j2j1J2lJ5qjlMpTP%TJQpNrJ1j7J6pN%TmJ2romr
6876 c6J3LRpNj0LMj3MK6k6L%J5j1LTorJ5j3J0pnMjoRLKJ3j3MroKQqJ1OnKj0Nj8QkJ0RjnrMOq
6820 b2mqJ1RJkj3KJ0Tj4J4j7%mJ2qmJ2NqOj0MPkJNj6J2nOqNqOoLMnNpJ3rJ4j7kNjTnMKJTQr
6763 a7j6NK1rJkpTJ2Qj4K0j4J4r%lJ0j9nJ6l%kqJ2j1QnJ3kMKj6mOQpMoPoQqKRj4jJ5j6J5%qn
6709 b4QoKRlk%Lj4J6KnKmj0J2mQqQ%mj1QKTmjNjMj0OQj5PkoNlk%J3jj1NpJjj3NJ1JlJ3jj6QO
6650 a2j1kQkjj0J8oNlpjJ1njkj7J1LjJ6j0mJ9l8N0o1L0KmPkj7PoKK4j1Qj1lJ3Np9M9j2J0K2J
6601 a8j0K7k1mJKl6M4k5J6rk3J0K7k7K9rj7K3knJTk7J2J5pJ1M%mj5R%kOkJ0j0MoNQJj4l%PlM
6551 b2JkoRMj2lNkLK%j2J4J5j0qnkjj0K5Jj3J1Pj4%RpLmJ5rNj4K5l3QJJ0j4MJJ2r%LlJ5j3l
$$ plain form
6934 -7 -9 -15 -22 -16 -4 -32 -15 -6 -21 -26 -25 -9 -14 -15 -24 -17 -20 -23 -19 -24 -20 -26 -19 -19 -35 -8 -20 -31 -19 -22 -7 -15 -16 -19 -15 -22 -29 -22 -22 -22 -21 -13 -20 -15 -24 -13 -30 -14 -21 -16 -16 -16 -20 -8 -17 -23 -27 -36
6876 -36 -23 -20 -11 -18 -13 -23 -20 -16 -29 -25 1 -25 -22 -22 -7 -18 -15 -12 -18 -27 -12 -25 -15 -22 -27 -23 -24 -30 -21 -18 -16 -3 -16 -12 -21 -27 -25 -17 -25 -14 -8 -13 -11 -21 -16 -34 -26 -28 -18 -9 -10 -15 -24 -20 -14 -22
6820 -22 -26 -34 -23 -14 -13 -15 -28 -26 -16 -6 -20 -6 -23 -23 -27 -15 -23 -27 -15 -10 -18 -12 -22 -18 -11 -13 -12 -7 -23 -11 -16 -10 -18 -13 -21 -15 -21 -18 -14 -19 -14 -21 -8 -17 -3 -20 -22 -17 -18 -19 -24 -20 -18 -17 -16 -8 -17
6763 -17 -33 -28 -7 -16 -15 -17 -24 -31 -19 -11 -25 -5 -19 -5 -14 -14 -17 -7 -26 -31 -15 -18 -18 -20 -28 -16 -27 -19 -24 -11 -13 -9 -7 -23 -27 -21 -13 -20 -16 -22 -15 -21 -13 -21 -19 -10 -24 -25 -10 -26 -11 -11 -19 -24
6709 -24 -16 -22 -20 -11 -14 -16 -16 -13 -27 -11 -9 -14 -12 -16 -26 -14 -18 -10 -18 -10 -10 -14 -25 -17 -15 -13 -17 -18 -13 -14 -10 -20 -14 -6 -21 -14 -16 -22 -17 -20 -22 -22 -9 -10 -21 -16 -23 -22 -23 -36 -31 -20 -19 -22 -9 -10 -26 -18 -12
6650 -12 -23 -25 -17 -19 -20 -30 -12 -18 -13 -16 -23 -24 -13 -18 -19 -21 -38 -27 -24 -25 -9 -19 -23 -4 -42 8 -53 -23 -21 -25 -18 -20 -37 -30 -36 -34 -10 -21 -13 -24 -27 -14 -9 -88 -39 -51 -41 -19 -18
6601 -18 -28 -1 -22 -26 -25 -23 -59 -15 -40 -24 -33 -56 -46 -19 -46 -17 -26 -43 -20 -22 -27 -26 -25 -52 -40 -25 -32 -21 -17 -17 -21 -36 -27 -27 -29 -23 -25 -15 -25 -21 -27 -22 -14 -13 -27 -30 -30 -23 -26 -22
6551 -22 -21 -23 -29 -20 -16 -28 -31 -26 -28 -25 -23 -23 -35 -21 -6 -16 -24 -29 -31 -32 -42 -17 -16 -29 -18 -11 -25 -25 -16 -23 -20 -24 -9 -18 -13 -27 -2 -35 -27 -26 -16 -30 -26 -25 -13 -22 -22 -19 -22 -7 -20 -23
6499 b3l4L4j1Pj2OQJm0K0K1qnJ0jJ1j6o7R9r1M2J3QTJ9o0L4Rm5J6lK5rJ2j1K4k6k1L1lM%m%
6455 b8k6J5K0j0P8q0mkQTn%J2j3jKPj3J4qLMj3J5j6MLPj0OTo%nrL0k0J0oLoRJpmjOkLTj6K5
6403 ij6MJNqPj0oJ0lLnNnPJnRj7O%LTpK0k7QmJ8j0lkj7K0j8J3oJ3j3J6k0NPoKJ0qNj8jJ5qj
6350 c7J2j1J9nQk2MJKJTJ0l0JPK2nLjKkJ5j9k3jK5QJrj9LJ2LPj8RJ3Mkj0j6npL1kJLj0%Onlk
6297 c0OJj0PJ0lqNnNMpJ3pn%Njk%pNLmKMmNkj1oPrJ4J3rlLjpklJ1jj2J2jTnjLMj5NOJ0lj3L
6238 c2J1k%Kj5MK1nj1j9J0J1lNoTj6L9j7oj2J6J8Jpj5QL2l0pJ9j3qKmj1J1O5j2q0L7NnKJ2J
6192 a0j1k1k4J7J2JQoK3K6l6j4K0Oj2J0j9J1qoQJ0jj0Rj1TkJ8nJ7rJ4mjkTpTK4Kk0PmQrJT%l
6142 b2TJ2j7Nj0J8jpLOlOj2Jj0RJ5pmqJ1lpJ1pPjKJjkPj2MjJ2j2Qj2k3L4qnJ4prmRKmoJ6J5r
$$ plain form
6499 -23 -57 -23 -34 -27 -39 -33 -25 -24 -64 -44 -23 -31 -36 -26 -27 -16 -32 -99 0 -91 -49 -36 -28 -20 -1 -61 -27 -18 -63 -47 -50 -25 -34 -22 -33 -9 -35 -56 -25 -28 -24 -24 -28 -28
6455 -28 -54 -39 -19 -29 49 -31 -35 -37 -29 -21 -26 -26 -14 -27 -28 -26 -19 -32 -18 -26 -23 -19 -32 -17 -33 -29 -26 -19 -29 -23 -17 -23 -23 -28 -37 -7 -27 -17 -23 -20 -26 -17 -16 -23 -27 -28 -22 -24 -21 -18 -34 -9
6403 -9 -25 -21 -20 -15 -23 -16 -26 -32 -22 -25 -22 -27 -22 -27 -20 -19 -24 -15 -32 -26 -26 -23 -20 -27 -7 -34 -26 -30 -12 -22 -25 -27 -44 -24 -42 -29 -35 -22 -35 -19 -39 -34 -27 -33 -31 -21 -29 -24 -42 -43 -28 -36 -37
6350 -37 -25 -36 -17 -22 -14 -36 -32 -31 -29 -28 -27 -17 -47 -46 -39 -17 -22 -19 -20 -18 -20 -5 -24 -47 -48 -23 -15 -14 -23 -42 -39 -27 -24 -17 -35 -26 -13 -9 -11 -21 -37 -42 -49 -18 -20 -19 -16 -26 -26 -20 -25 -28 -30
6297 -30 -24 -23 -33 -26 -16 -19 -27 -22 -27 -22 -18 -25 -12 -19 -24 -24 -19 -20 -22 -22 -29 -24 -21 -25 -23 -19 -23 -18 -20 -31 -37 -30 -39 -25 -12 -21 -24 -21 -22 -29 -31 -34 -23 -24 -36 -24 -25 -26 -31 -32 -29 -25 -40 -35 -29 -19 -22 -35 -32
6238 -32 -21 -23 -23 -21 -36 -32 -11 -16 -27 -46 -36 -25 -28 -23 -29 -35 -51 -12 -29 -35 -47 -31 -13 -12 -19 -34 -26 6 -24 -31 -12 -25 -33 -31 -35 -46 -35 30 18 -62 -25 -20 -25 -23 -11 -10
6192 -10 -21 -42 -66 -49 -37 -36 -28 -34 -11 15 -21 -35 -15 -9 -21 -11 -30 -19 -27 -33 -25 -15 -16 -26 -17 -28 -39 -41 -23 -28 -11 -20 -6 -10 -11 -13 -15 -22 -29 -5 -3 -23 -16 -20 -12 -21 -20 -19 -19 -22
6142 -22 -22 -10 -27 -22 -32 -14 -15 -22 -19 -13 -16 -10 -22 -21 -31 -22 -7 -14 -18 -26 -15 -18 -25 -14 -21 -14 -15 -13 -12 -13 -15 -8 -20 -16 -17 -5 -17 -9 -21 -44 -10 -18 -23 -9 -16 -25 -29 -20 -18 -22 -28 -12 3 -6
6088 ij6J0J5Nl8K9Kj7J0j7qK2Kj4L1prJpk2J3L4m2J4kjJ3RqRkOn0J5J2Q%rkJPlj7L1J2pmqkT
6038 a2LL2k6kjpKQlqJ1%Rk0J9j0%Mkj2lJ0j8J4JK0KqTJ%pJ3j4nJ0J3o%jRKQj0j4J0qJ0j8J2N
5987 EJ4j7J8qOpLrkNmLPrkO%rJ1k%rRlJ0j5Ppj1J9rJ5k0QRj0kJ1J3k2Q%ljkJ%K0nLj1J0Jj3r
5932 ALjJ1Rj0LqKJTj8JQJ8j9lJ1QqkqNOqo%KL3Rj4k6K8j9RJ0J3lNj9J9k0jTL9o0q3M9L4JKkm
5880 bK1Lk2K3L4j6rOj0J1J2K8j2k2j6kMJ3KJ19j8j02J6j6lJ1mP5q5j6J2jJ7OJ51j65lJ4j4R7
5840 A37j06kTQPMK4J00k3j06lj7ONT%LJJ0j4j6kRMTlNkq%J1rmj9J8nJ4j2%TMj2KPkJTmLKJ0
5789 C4J4j3qjrJ8qj5kJ8JpqKOnP%lpLNj3RNj1PJ8kK6k7Oj0TrRJ0MlNJkNj0J51j26Qj5lM7m3m
5737 D5jNj7QJqmNMnJ4mK3N8p2PP3o8J40j03R5j22nk2plnJ4Lj3ONnJ5rMLR0q9kKOJ41j43lnjl
$$ plain form
6088 -9 -25 -15 0 5 -33 -4 -2 -19 -9 -26 -34 -12 -10 -24 7 0 -9 -8 -15 -37 -24 10 -32 -18 -20 -21 -8 1 -7 2 0 6 -44 -29 -17 -9 -9 -18 -20 -19 -12 -15 -32 -1 11 4 0 -8 -10 -12
6038 -12 -9 23 -3 -5 -6 -13 -11 -3 -6 -14 -3 -3 6 -14 5 -5 -5 -1 -3 -15 -18 -8 -26 -12 -11 9 11 3 -5 -4 -4 -11 2 -12 -17 -7 6 0 0 -1 8 10 18 8 -6 4 -4 6 -12 0 5
5987 5 19 2 20 12 18 11 14 5 3 8 4 7 14 5 3 9 9 0 11 9 9 0 9 6 16 1 8 1 -10 9 0 15 -5 3 12 2 0 11 24 2 10 10 7 6 4 5 5 25 20 23 12 22 23 10 1
5932 1 4 3 14 23 13 16 8 10 11 12 -6 -5 3 21 2 -1 10 18 10 8 0 5 11 3 -3 -3 -1 32 41 27 1 29 10 19 29 42 39 44 25 44 24 23 22 61 1 -82 -33 1 2 4 2 -2
5880 -2 19 22 0 23 57 41 32 38 28 39 51 79 67 45 29 27 31 44 46 165 147 45 61 45 42 53 49 124 39 23 35 34 51 57 208 43 40 54 40 137
5840 137 31 29 27 35 42 46 70 170 147 41 38 21 27 32 37 37 40 41 51 37 21 19 28 32 36 33 38 36 28 28 39 30 26 7 25 20 34 22 22 22 26 14 16 23 21 22 23 19 22 24 34
5789 34 48 35 27 26 17 35 27 12 10 28 29 22 14 16 22 17 24 24 21 14 17 22 9 18 23 12 19 37 35 61 34 40 30 20 11 20 30 34 31 36 37 35 40 30 181 55 63 48 45 92 49 45
5737 45 44 49 32 40 41 33 29 34 38 33 47 43 66 124 52 59 132 64 204 101 196 74 69 47 40 37 32 46 49 36 42 47 42 57 48 52 55 145 56 54 56 62 203 60 57 52 51 48
5689 D8pKnOoJ6j1M%lTJ0j1NjPrPJ9r%TnJ5j1j0QoTnK1Qj0J3k4kTJ7pJ6l4M6l1M9jj4j6kK3K1
5639 A10M5o8l0L5%LOL3L1K08j17LM89m86l8J6K9P8J71K37M20J983K263m093m46j81q5Q8K10
5610 I14J35N14O11O971q518l99J03o4M58J46Q164k959m977m03j8p4L9J61K12M80R21O599
5588 I016m518k680o47k86o1K1j09l5K4oK031j101r00j66p5j5k0jk9k1%m5j1k3pMk0PKj2j4L5
5556 C38n2k3Rj5kL8m3Oj4TnJ3J4j1PkM6p1NL2k7%K0l0jk3M6l2k4L4l4J5K6rm4J1M2nk3N6j9
5515 B35M7N94o99M9j6M0j1J1M5M8J04J09J745l10j274kq5J89p3K56L48R35R96J0262j26
5490 A3417j2634l07J0j30K93k3O13O1K081K90J1658j2256p54m1M32O60J1667j2597j227j94
5470 A019J76l39O1L03K03O02J764R256j1682m71j39j1M5j98K3J93k30J638j481L54n53q3k9
$$ plain form
5689 48 41 43 38 44 38 54 43 47 47 44 41 51 40 45 44 51 42 49 68 59 59 59 54 69 58 48 56 50 44 39 60 68 58 71 47 45 43 60 53 69 35 81 50 99 98 84 68 66 89 110
5639 110 155 87 57 92 92 95 101 134 165 373 256 259 748 262 224 240 269 347 518 755 1175 3158 5421 1328 882 701 616 704 914
5610 914 1049 1563 2174 9145 627 228 331 267 725 871 9035 6076 1099 696 678 604 643 804 1016 1496 2417 9016
5588 9016 4498 1818 1171 885 824 845 736 701 725 719 2750 1649 749 583 508 493 473 472 443 422 422 377 366 343 336 340 320 327 329 317 303 338
5556 338 286 263 272 257 255 293 250 256 242 228 223 236 250 239 246 244 290 219 224 256 229 229 249 219 218 195 241 209 185 219 185 200 226 217 173 184 226 221 198 254 235
5515 235 282 876 177 226 210 250 239 250 295 343 447 556 2301 1991 717 715 630 819 746 1002 1350 2285 3281 13543 13417
5490 13417 783 476 486 356 649 626 1239 1300 3381 3671 15329 3073 2319 2278 2710 3370 15037 2440 1213 1019
5470 1019 1195 856 917 1220 1423 2025 3789 13045 1363 892 753 742 787 589 612 805 575 2213 732 1086 533 450 421
5447 D21k0QJ9n9J3l3N1p6k7qJ6k8Rk4PL8l7l9j1k6NK0j8L0n4j6lPj1rj5J3JJ0j6k8oMoM%k2
5405 H4J6j4%ok0NlnNrOn%rj4RqK%pJ0Jroj0J1J0j7J7Kk6Qj2jJ7rJ32L5j52J8J2n5qJ3kJ23
5359 A29j03olLJ14q6j9k9Qk0J8J10r0l9J5jJ0kJ02Lj15J7Nk5j3J2%JPjj1J8j0TNnOj5RLk%Jp
5315 a6RKlj0J1k0J5j3J2KRjTj3J1j4MkOjJ2orl%MTjlJOTm%mnMnJ1kj1JTLjJ7j5q%MPpJOjJ56
5259 A46j18j1pM8k9k8Oj2JjTNorKJ2kKmj1K2Q2J9n7k0Q9j10J43j37jk6O%mJ2prKPJM%kJ2J08
5214 A17j23%jQJ24j19qkpJ1qlj0M%TJ4%OLJ1k4poOj6J6Qoj4J6J0qpOJp%JRj2qPTj%Jj2OJ0n
5163 a2j7J0oK9j8NoKmJ1j0rK5j3Rj6PNp%RljLlJQjj5%RLoNrkTRoKnPlNQjk0PJ1j8QMlMlj1Ol
5105 b1%OTkjLkKp%J0q%jOojj0J5KjKmjJ%mQkj1J3j2K0k1jRPQj0j7kK0j7pJ0J3j4lJ6Mj0mTKQ
$$ plain form
5447 421 401 409 428 369 382 349 400 324 297 289 305 277 286 262 269 307 270 231 220 194 199 219 201 231 177 161 158 165 154 145 130 143 144 154 138 110 104 108 102 106 106 84
5405 84 100 86 86 80 60 65 62 57 62 53 59 54 54 45 31 40 32 34 34 27 37 38 29 23 13 24 34 17 34 36 10 18 6 5 22 13 145 180 28 46 58 3 -5 8 6 129
5359 129 26 20 17 20 134 48 29 0 8 -12 6 116 26 -13 2 1 11 9 111 114 -1 16 21 -4 -17 -5 -5 -4 3 2 -9 9 -1 -11 -6 -11 -5 -20 -11 -8 -10 -10 -9 -16
5315 -16 -7 -5 -8 -18 -7 -27 -12 -25 -13 -11 -2 -3 -4 -17 -6 -20 -16 -18 -12 -13 -1 -7 -16 -19 -19 -15 -11 -12 -15 -14 -8 -2 -6 -6 -10 -15 -11 -16 -5 -7 -18 -17 -16 -13 -14 3 -12 -20 -20 -16 -9 -16 -15 -9 -10 146
5259 146 28 17 10 58 29 1 7 -5 -4 -5 -6 -1 -7 -16 -14 -2 -4 -2 -6 -17 5 87 106 49 29 118 8 151 14 13 -13 -7 -7 -11 1 -6 -15 -13 -6 -5 -1 -1 -3 9 117
5214 117 -6 -6 -7 1 125 6 -2 -4 -11 0 -8 -11 -21 -17 -17 -17 -3 -3 3 6 17 -7 -14 -20 -14 -30 -14 -6 -12 -26 -10 0 -8 -15 -9 -8 -15 -15 -14 -5 -17 -25 -18 -11 -12 -12 -11 -23 -17 -7 -12
5163 -12 -29 -19 -25 4 -14 -9 -15 -13 -17 -6 -16 -25 0 -13 -4 -20 -13 -8 -15 -15 -6 -9 -10 -7 -10 -9 -1 -2 -17 -17 -8 -5 -11 -6 -15 -17 -19 -10 -16 -14 -19 -12 -15 -10 -2 -3 -23 -16 -5 -23 -15 -11 -14 -10 -13 -24 -18 -21
5105 -21 -21 -15 -9 -11 -12 -9 -11 -9 -16 -16 -6 -14 -14 -15 -9 -15 -16 -26 -11 -9 -10 -8 -12 -13 -12 -12 -16 -8 -10 -21 -8 -20 0 -21 -22 -13 -6 2 -8 -25 -27 -7 -24 -31 -21 -8 -22 -25 -9 -5 -15 -19 -23 -21 -13
5050 a3J0j8LpJ0ljJ3j0QlrKjJ1%Lj0J%pK0Jj2J1j3jnmJ4Nj%kQoj5JkJ3kJmRk7J4NnkJ2J0k7P
4997 a8LpTJJ4j%jkjPkrNLJMk4J5JkJ6opomPJ2MnTO%kTJoJ1k7J5PQj3onJ1jKRlj3J2n%Kj0k0
4940 d3K3j1K3%rj2QMloNKnJ1j2Oj0J1mNjpJ9MroJnNoJ9j2mkPknJ3lpJ2lk6jK0%QlUNj7J5l2
4886 d6K1J2lOkk8J1KK7k0J1Oj3nPoj6KJ8KjmlRNjj0mL%Pj0J1Nj5PlqLlQJ7qPqPj5pTJ4mQTm
4832 a0j4kJ1j3QOQj1Pj6J1mTPj3J7Mj6jNLoLOqNKLrkjJ0j2J2Lj5kNqJ3lTj3J9jNkrJmPTnLlj
4776 b0J5pk0RknJ0kP%MmjlnrL4k0%OpOj1PoMk%jJ%J3j6kOk0J7OpJ1j3Qk%MNqjJ1kJ2j1oj1Rn
4720 b4K7j5MoLj0J0lKk1RK2j0kj1Jkj2J6Pj2K0kTj6J0lqOLj3LPoJ5pj6oRJ8pJ3j2oJ1Mj0Pjp
4670 b3LQqJkJPj0Mmj8M5l3OLJMkj5K1qpKPOj0J7j5pNpJ2JjKj3LOj0J%NK5k4mj%J5j7OJ2j0lk
$$ plain form
5050 -13 -3 -21 -18 -25 -15 -18 -19 -6 -16 -8 -11 -20 -18 -19 -8 -8 -5 -15 -14 -14 -21 -1 0 -12 -1 -14 -15 -20 -24 -10 -5 -6 -6 -8 0 -6 -21 -20 -22 -9 -11 -10 -14 -5 -32 -18 -13 -18 -20 -8 2 -25 -18
4997 -18 -15 -22 -29 -28 -14 -15 -15 -16 -18 -19 -12 -14 -23 -18 -15 -14 -10 -34 -19 -18 -20 -4 -10 -17 -23 -27 -20 -8 -4 -9 -14 -8 -8 -10 -12 -11 -17 -6 -33 -18 -11 -3 -16 -22 -27 -16 -17 -15 -6 -9 -22 -10 -15 -15 -13 -23 -43
4940 -43 -20 -31 -8 -8 -17 -29 -21 -17 -20 -26 -21 -19 -24 -13 -25 -19 -29 -18 -22 -17 -18 -25 -6 -2 -11 -17 -16 -21 -16 -22 -3 -15 -19 -21 -14 -16 -21 -8 -11 -18 -6 -9 -35 -36 -16 -16 -8 -11 -14 -17 -12 -29 -14 -46
4886 -46 -25 -13 -16 -10 -12 -40 -29 -27 0 -20 -9 -3 -16 -21 -14 -20 -36 -34 -16 -14 -15 -19 -22 -13 -8 -9 -19 -23 -20 -20 -13 -23 -12 -7 -22 -15 -18 -26 -23 -26 -18 -1 -9 -2 -10 -3 -18 -25 -32 -18 -22 -14 -6 -10
4832 -10 -24 -26 -15 -28 -20 -14 -6 -17 -10 -26 -15 -19 -23 -16 -29 -12 -8 -24 -25 -20 -17 -23 -20 -14 -22 -17 -15 -12 -21 -23 -24 -14 -26 -14 -11 -26 -28 -23 -31 -18 -21 -24 -37 -18 -19 -14 -16 -25 -24 -28 -21 -14 -19 -16 -19 -20
4776 -20 -5 -12 -32 -23 -25 -30 -20 -22 -15 -15 -11 -15 -16 -19 -24 -33 1 -19 -19 -13 -20 -14 -25 -18 -24 -20 -22 -22 -23 -22 -22 -9 -25 -27 -21 -41 -24 -18 -25 -14 -27 -19 -21 -21 -17 -12 -20 -21 -10 -12 0 -11 -17 -28 -19 -24
4720 -24 3 -12 -8 -14 -11 -21 -11 -14 -12 -33 -24 -2 -12 -14 -25 -24 -26 -38 -22 -15 -27 -7 -9 -11 -27 -17 -20 -28 -22 -19 -32 -29 -22 -28 -13 -20 -36 -42 -33 -15 -22 -9 -21 -27 -16 -12 -22 -15 -16 -23
4670 -23 -20 -12 -20 -19 -21 -20 -13 -23 -19 -23 -41 4 -29 -23 -20 -19 -15 -17 -32 -11 -19 -26 -24 -17 -11 -21 -4 -19 -26 -21 -28 -16 -15 -16 -14 -27 -24 -18 -28 -27 -27 -22 3 -21 -25 -26 -26 -11 -28 -22 -10 -20 -23 -25
4616 b5j1RrK7j7J3Pqlj1lLQpQNMj4Pj0oKJ2J6k1J4MprLkNpJ0nKLn%kpJ8j2NJnj4J6j4NljQoR
4561 b0LlJ0Jj2Jj0qJ0lj4J8K4mk0M%TnJ0qmJ1J6k2J0oj6JJ7J3j5j1K2lpKj6j5QK0lNLMj5Lo
4513 c0J9l0K7j7%RqJ0LpJ2j6J8j6J0qmJ4j3MkMmKrJ3Rj3jMTrKnmJ3ljJ7j3Rj8PJj1J4npK0k0
4463 b9J8ljj1j0L2qnKlj3K2j9ORj7RNTj2kPj0Qj9RK2k1jJ8j2Qj1oONpkj3J7J9j9jJ0r%J7j0r
4414 b9j7J9%J3mRjk1J2J0j0KkLJnMknMTmRqj%Knj1N%loJ2Qpj0oNMJ5lnJ1nkk3JqJ4j6J4RQPk
4358 a6j3J5j2J3j2j7J8%K2k5OlnK1j8mJ8nqjKQjMoNJ6j1j8J2ploL1k0J4j4J3j4j3p%K9rjpL
4311 b6j6K3j0K4j4kQk7nMK6k2QlJ2j3j%Mj0J7Mj0J3j4j3K0NlpJ2pJ4kk1KpJ5oOm1N1l1L6j7q
4265 c2jL3m6M0l6J7rK6j2oj9j8M9k6J1L1Rk4Nm7N4m1rM3jkk1L2k5J7j7J1jK1qk7J5Pj4MkPl4
$$ plain form
4616 -25 -36 -27 -36 -9 -26 -13 -6 -14 -17 -28 -31 -28 -20 -27 -19 -14 -10 -24 -17 -27 -33 -31 -19 -3 -24 -10 -6 -13 -22 -19 -21 -16 -23 -13 -18 -16 -13 -18 -18 -20 -27 -9 -21 -16 -15 -20 -34 -18 -32 -27 -30 -31 -23 -29 -20
4561 -20 -17 -20 -10 -9 -21 -20 -30 -38 -28 -31 -45 -27 -3 -7 -27 -23 -23 -23 -28 -18 -26 -30 -19 -3 -25 -15 -21 -37 -36 -19 -6 -21 -32 -10 -13 -20 -18 -34 -49 -41 -21 -24 -19 -16 -12 -27 -24 -30
4513 -30 -11 -41 -14 -31 -31 -22 -30 -20 -17 -24 -12 -28 -10 -26 -16 -24 -28 -14 -27 -23 -25 -21 -25 -23 -32 -19 -10 -23 -24 -20 -16 -25 -23 -28 -32 -19 -22 -23 -6 -19 -10 -28 -21 -20 -31 -17 -22 -29 -9 -29
4463 -29 -11 -14 -15 -26 -36 -4 -12 -17 -15 -18 -31 -9 -28 -22 -13 -30 -21 -16 -11 -23 -25 -18 -28 -20 -39 -30 -8 -29 -30 -12 -24 -16 -27 -33 -27 -22 -29 -31 -44 -27 -8 -27 -28 -18 -27 -27 -10 -20 -29
4414 -29 -46 -27 -27 -14 -18 -9 -10 -31 -19 -9 -19 -17 -19 -16 -15 -20 -16 -18 -23 -19 -15 -19 -10 -18 -19 -19 -17 -22 -33 -28 -28 -31 -37 -25 -17 -24 -34 -40 -35 -31 -16 -19 -24 -13 -18 -20 -43 -42 -50 -36 -52 -38 -29 -21 -14 -16
4358 -16 -29 -14 -26 -13 -25 -42 -24 -24 -2 -27 -21 -24 -29 -8 -26 -30 -12 -17 -25 -26 -24 -16 -17 -13 -19 -14 2 -9 -27 -15 -22 -25 -31 0 -20 -6 -20 -7 -21 -34 -41 -41 -12 -21 -22 -29 -26
4311 -26 -42 -19 -29 -5 -19 -21 -13 -40 -45 -41 -15 -37 -29 -32 -20 -33 -34 -34 -30 -40 -23 -19 -29 -16 -30 -43 -23 -18 -21 -28 -16 -23 -9 -11 -32 -30 -37 -22 -28 -22 -63 -12 -43 -7 -24 -32
4265 -32 -33 0 -46 -6 -42 -25 -34 -8 -20 -26 -45 -63 -14 -40 -29 2 11 -13 -8 -55 -1 -42 -51 -8 -9 -11 -32 0 -25 -8 -25 -14 -15 6 -2 -29 -14 -7 -21 -17 -19 -12 -46
4222 d6J7NMJ5k6J5j4LTj8K4Lnl%Pj5OMmrlK1j5J0qrQJ0j2PmT%KJ5j2rK9j1K0l2J3Qj6l%j8j
4173 d8L0k1Qj2j1J1K4Kj0RLmj6LrK3%rpmj2K2T%l8OJ8J3m2J0NJ1Llj0NK4k2J9RQo2M1Nm1j8
4127 f5o2O4J13l4k4RLRm1k6L7jk1N5j9jJn4O5oJJ4j0l9JO3k9n3P7N5q0m7L0j00J14j3nq7R9
4088 gk1K0j6P9r6ML3Ok0j5K6rLk9K7J7k1Rm4K5pj0N0k3L7l1Mk4J1O%j3NoJJ2Lj3Rj5LRJjl7
4043 e8K4jJ4j1KJ1k9OrL4k8M8j6l5L0k2J3nqK7rj5RlJ0K8l8J5mJ3m7K3k2N0pnJj7K3pj0loM1
3999 Gm5K6j2J0j5kPK0mk3L1m0K5j3J6k0K0j9L1j3jpoJ2J4j3%Kjj3JmqKRkK3j3j7J6j8J9J2j3
3955 a9k9L2k1K4j3lJ5no%oNmJ4mOMok4J2Tl%j8KNK5k3J8Pqj7Kj7M0m1K1J2j0mpOj3KJ1j1Om
3907 c5J6mNj6J9Kj8KJlj1K6j5j3QL2rk9PT%JJ4j1rJ3oRkQj9NjJk5J0K2qJj3LPnLj5K1j3K3j0
$$ plain form
4222 -46 -29 -24 -20 -5 -31 -16 -30 -27 -24 -42 -18 -15 -20 -23 -23 -16 -31 -25 -21 -25 -34 -37 -16 -31 -21 -29 -38 -30 -20 -32 -25 -29 -33 -33 -31 -16 -28 -37 -8 -19 1 -31 -18 -10 -26 -29 -29 -47 -48
4173 -48 -18 -39 -31 -43 -54 -43 -19 -17 -27 -18 -15 -19 -35 -32 -41 -18 -18 -27 -34 -38 -50 -28 -6 -6 -44 -38 -20 -7 -49 -39 -34 -23 -20 -23 -33 -28 -4 -26 -7 2 10 -52 -11 -6 -47 -65
4127 -65 -127 -63 50 16 -8 1 4 13 -28 -54 -17 -18 -39 16 -3 -4 -3 -57 8 2 3 17 7 -32 -31 32 3 -50 27 82 2 -45 -15 -115 -1 -14 -19 -106 -7
4088 -7 -28 -8 -24 55 -41 -37 -4 2 -18 -33 -7 -16 -13 -42 -15 2 -19 -10 -54 -29 -36 -46 4 -19 18 -13 -9 -33 -22 -16 -16 -29 -24 -30 -29 -17 -14 -27 -18 -33 -30 -21 -20 -21 -58
4043 -58 -34 -35 -21 -32 -30 -19 -48 -42 -51 -17 -45 3 -13 -48 -18 -40 -27 -32 -40 -13 -22 -37 -28 -31 -21 7 -31 -16 -20 -7 -54 -31 -53 -3 -10 -15 -14 -31 -8 -15 -25 -28 -34 7
3999 7 -38 -12 -24 -14 -29 -31 -24 -4 -8 -31 0 -40 -15 -28 -12 -32 -12 -31 0 -13 -14 -21 -27 -15 -1 -14 -14 -12 -13 -26 -25 -29 -37 -35 -26 -28 -5 -18 -35 -19 -37 -18 -6 -19
3955 -19 -48 -16 -37 -13 -26 -29 -14 -19 -25 -25 -31 -26 -30 -16 -20 -14 -10 -16 -40 -28 -16 -19 -19 -37 -35 -30 -5 -28 -10 -3 -11 -28 -26 -43 -3 -44 -23 -11 -21 -25 -32 -26 -39 -37 -26 -37 -31 -35
3907 -35 -19 -23 -18 -34 -15 -13 -31 -29 -28 -31 -42 -16 -31 -44 -36 -4 -13 -42 -35 -28 -28 -27 -13 -24 -33 -20 -26 -17 -19 -11 -30 -25 -26 -25 -50 -40 -18 -26 -25 -38 -35 -28 -33 -30 -45 -24 -37 -14 -24
3858 b4qLRJ2j3Rj6J0J%k6%K9j2J7k1J2nojK1j6K8k6rKMR%oK0qp%j4%J8pr%NMj5J3oNTk0%TQ
3807 c1J2oNJ2j1L2k7%j3MmPj1LJ7qPj4J0rNMlrqJ1rLJ1LrNJ0nj5KnJ5Mkj1jJJ5Nj5%joJ3Pr
3755 a9j4%K1jj1J0mj5kJ3oqQTnrJ5mJpRjmMK0j9j2KJ8n%pnlJ7j8J8j7OLTpJ4j6jJ4njpJ7Mk6
3703 c4NJ1Lj9J7Kmj0J1nj4mJ0M%K7m0J4kNTJ9k0OmJ9l9J3J7j2J7j3j1MPNMl2L5k5qJ3Rn7J1
3658 f0O8K1l4j4j5kJ6j6K1j9k6M9nmj6RnJ0RNpj1pnJ1Joj3J1K5j4PmM%TpkKkj2OM%J0orKJ2%
3608 a8lnPoJNl%j3LRjj0Pl%lJ7nk1J6kTKPMqJ6Jj1TolRJ1J3Kj1jJ0j2k5OKJ6Nl0J5L3nj7lo
3555 b7J9j0k2%l9N1O1n6qpmo9Q0M0l1ml5M4l4j2J7q5N59p60K33O5K1K0n9J6K6l3kk9J16l0k8
3518 a6PKn7K9P9l1k4jl3K1MlJk5J6L1k3JoQKnj3MJ1mpmJ6nPj1jj7J5NrJ1jMOJ3k5kJLrj2J9l
$$ plain form
3858 -24 -32 -29 -20 -8 -21 -12 -28 -18 -17 -17 -43 -43 -14 -26 -9 -30 -18 -23 -29 -30 -9 -25 3 -23 -32 -30 -26 -17 -17 -23 -3 -11 -18 -18 -32 -32 -14 -21 -30 -30 -25 -21 -36 -23 -29 -24 -19 -39 -39 -39 -31
3807 -31 -19 -25 -20 -8 -19 13 -14 -14 -27 -23 -27 -20 -31 -28 -11 -19 -12 -26 -16 -25 -20 -16 -19 -28 -36 -25 -34 -31 -20 -17 -26 -21 -11 -16 -31 -29 -34 -19 -15 -17 -28 -29 -28 -13 -8 -23 -23 -24 -30 -17 -10 -19
3755 -19 -33 -33 -12 -13 -24 -14 -18 -33 -35 -22 -28 -36 -28 -20 -25 -34 -19 -23 -22 -29 -20 -21 -25 -21 -1 -20 -32 -30 -12 -17 -17 -24 -29 -32 -15 -33 -15 -32 -26 -23 -20 -27 -13 -29 -30 -16 -21 -22 -29 -12 -8 -34
3703 -34 -29 -18 -15 -34 -17 -15 -19 -29 -18 -23 -37 -41 -31 -27 -27 0 -40 -26 -28 -23 -18 1 -19 -13 -17 2 -37 -24 -7 -19 -2 -15 -26 -22 -15 -10 -6 -38 -3 -28 -36 -23 -14 -71 -60
3658 -60 8 29 -5 -19 -34 -36 -20 -36 -15 -34 -60 -11 -16 -20 -36 -27 -32 -22 -13 -8 -15 -26 -33 -38 -27 -26 -32 -45 -34 -9 -23 -16 -20 -16 -16 -16 -23 -25 -23 -25 -37 -31 -27 -27 -17 -23 -32 -30 -18 -18
3608 -18 -21 -26 -19 -25 -24 -19 -22 -22 -35 -32 -23 -24 -34 -27 -30 -30 -33 -16 -21 -42 -26 -28 -30 -28 -21 -17 -25 -9 -8 -19 -30 -36 -39 -30 -19 -6 -4 -15 -16 -6 -18 -43 -37 -35 -19 -14 -44 -29 4 -1 -18 -21 -27
3555 -27 -8 -18 -40 -40 -79 -28 33 -23 -31 -38 -42 -111 -31 9 -22 -26 -61 -17 -51 -63 -46 -131 428 -332 -99 -34 -13 7 -52 -36 -10 -43 -45 -74 42 12 -16
3518 -16 -9 -7 -64 -35 44 13 -11 -12 -45 -24 -20 -23 -22 -47 -31 0 -23 -22 -28 -20 -18 -23 -36 -32 -21 -25 -32 -36 -20 -25 -18 -29 -30 -47 -32 -27 -36 -25 -26 -22 -16 -3 -28 -30 -29 -26 -35 -47 -28 -31
3468 c1J0%oJoNoOkLp%J3qJ8rj2moJ4J2jrpmLProJ0TMj3j0L8k5Pmj1NRj1lnLJ5Qj0Prl9N5K5
3415 A5m1QLpnmJk8NL6L3l6j3mL5n4M1j1qLRLmqK4k4qK7j6%qmJnK0nJ7oj5mJ6j6J6J0j2j6%K9
3367 a0k6LJ4kj1PJ2j2Kj0QjRmjNnMpjOkj0J7j0klRJ0j3%kJ4j9Qj2MK0pTLmkKlnJ9j5kJ4JJ3
3315 dj4j1J3nRj4jnJJ0%k%j2jK6Mk2rJ7j2NK1j4j0KpJ6jJ1j6%PTpk4JJ2ToQJ6l8QnL9l0mJM
3265 b4J6L3p7Q2r7M1j3kL8j7j3QK9j29J73j03L3mOj7Q2j33O3J4pj5kJ8qJ7m8M9M5j11J9RK2n
3227 b8j0TL7nl0%M0j2j0PJ6k1j4RJ7%oj6OJ2jJrTJ7mMj0J1j4R%oJ2k1J0PmrPJ2j3mMnJ7nmTM
3177 b5qKJ9j9J2j6PMnJ%J5qk0J7jj2nMRMJ1J8k6k0K7oJ1j8L2l3k3L9QMj4MJ4oLj21J17k5l1
3133 f0K2KJ2K6k8K5p3R0q0pL0NJ0J4k26L48j97M5Rk8K3rJ6J3o8J1Q3q5L7j7J0L4l7j1K9J0k4
$$ plain form
3468 -31 -21 -21 -27 -26 -32 -27 -33 -27 -29 -26 -33 -33 -20 -28 -10 -19 -31 -35 -41 -27 -15 -16 -25 -32 -36 -33 -26 -35 -41 -31 -21 -17 -30 -40 -2 -27 -20 -24 -35 -30 -21 -32 -35 -40 -37 -22 -14 -24 -17 -26 -65 -10 15
3415 15 -26 -18 -15 -22 -27 -31 -30 -58 -53 -17 16 -20 -33 -37 -2 -56 -15 -26 -34 -31 -22 -19 -23 -31 -7 -31 -39 -12 -28 -28 -36 -40 -39 -44 -24 -29 -12 -18 -33 -37 -21 -37 -21 -11 -23 -39 -39 -10
3367 -10 -36 -33 -19 -21 -32 -25 -13 -25 -23 -33 -25 -26 -17 -21 -22 -17 -22 -18 -25 -26 -20 -22 -32 -15 -25 -27 -30 -21 -11 -24 -24 -26 -12 -31 -23 -35 -31 -11 -18 -25 -22 -26 -28 -26 -29 -34 -15 -30 -32 -18 -17 -4
3315 -4 -18 -29 -16 -21 -12 -26 -27 -32 -31 -21 -21 -23 -23 -35 -36 -10 -6 -28 -37 -20 -32 -27 -6 -20 -30 -28 -35 -19 -20 -9 -25 -25 -18 -11 -18 -42 -41 -29 -17 -23 -15 1 -37 -29 -34 5 -25 -29 -28 -24
3265 -24 -8 25 -52 30 -67 -26 -39 -41 -3 -20 -33 -25 4 -125 48 -55 -22 -26 -20 -37 45 -88 -25 -11 -18 -33 -35 -17 -25 -8 -56 -7 38 -73 -54 -45 -23 -28
3227 -28 -38 -48 -11 -16 -46 -46 -6 -18 -28 -21 -5 -26 -40 -31 -14 -14 -20 -36 -30 -18 -19 -18 -27 -36 -19 -23 -19 -29 -18 -32 -23 -23 -29 -17 -38 -28 -21 -25 -34 -27 -15 -28 -32 -28 -33 -16 -21 -25 -29 -25
3177 -25 -33 -31 -12 -31 -19 -35 -28 -24 -29 -28 -28 -13 -21 -41 -24 -25 -37 -42 -38 -29 -25 -14 4 -22 -42 -15 -21 -10 -28 4 -29 -52 -13 -5 -1 -15 -11 3 -3 0 -121 -4 -29 -60
3133 -60 -38 -36 -24 2 -26 -1 -74 16 -64 -71 -41 -36 -26 -12 -238 110 -87 -42 -33 -61 -38 -47 -31 -18 -86 -75 8 -77 -40 -57 -47 -13 -50 -61 -32 -22 -46
3096 d6j6M2j5j1K3J5l1j9M0j6%mL%J1%mrO%J0j2lO%nLJ0k3KPMjQmM%jj1lJ3%kKlOoLNj3PLpj
3042 c3J4j4J1j6jRmJ3opKNj1J0mjkJ1pLRj8mK1o%j0lPqK5Mj5k7L1LnOPl3QJ5kPj4Pj0oK8Kl0
2991 c9QNLqoK2k6K1m%j7K1mJj5J8pnJ6kpJ4%j3m%Oj4J0JnJ1J%onMj6J0LnJ2KojQj2jkJ1j2m
2939 c8K1k2PjLNRj6Pj0Pp%J6rmJ3qpLToPj2OMj5K8roMJ1j6mJ7j3J6j6jM%J0mrJ5rM%JmpJ0%T
2885 b2j4JlMQJmLjMLk5J1LJJ3j6kMQlpJ2j6kJ2Nj1nJ8qLlOj7J2OpoMqJ3j4J2NKRnNj3rJjOP
2830 b0j8JJ3oJ3k2J6onKTjj1QpJ1kjkJ9j3KpMK1k1oJ0r%J7mj0J2mj2K1nj4K%J5j7PRj2Ljkjm
2779 c5K0j5nLNMRqnJpJ0LrJ1j0MrRJr%qJ6nJ1qKnLO%omMrK4j9LTrJ2j0RpljK%JqK8j7N%lkj
2721 b8j1J2JJ0j3JJ0%n%k1L2k1OTj2nJ7j0RMJ5m2J5QkKrJ5nj6L3k5K5k8M%qPj3rM6j9JnmKMp
$$ plain form
3096 -46 -62 -20 -35 -46 -23 -8 -39 -58 -18 -34 -34 -38 -35 -35 -24 -24 -28 -37 -31 -31 -21 -33 -36 -30 -30 -35 -32 -22 -45 -43 -36 -32 -33 -25 -29 -25 -25 -26 -37 -40 -27 -27 -29 -27 -30 -24 -30 -27 -22 -35 -28 -25 -32 -33
3042 -33 -19 -33 -22 -38 -39 -30 -34 -21 -27 -34 -32 -27 -38 -28 -32 -33 -35 -24 -31 -28 -19 -37 -41 -20 -26 -26 -36 -39 -32 -40 -15 -11 -26 -53 -22 -19 -24 -18 -11 -44 -36 -21 -23 -16 -30 -23 -33 -39 -11 -9 -39
2991 -39 -31 -26 -23 -31 -37 -15 -41 -20 -24 -24 -41 -20 -24 -23 -38 -20 -27 -32 -16 -18 -25 -11 -11 -24 -28 -28 -22 -36 -26 -25 -30 -19 -18 -18 -24 -29 -25 -41 -31 -28 -33 -21 -19 -25 -26 -18 -30 -31 -33 -22 -34 -38
2939 -38 -17 -39 -32 -33 -30 -25 -16 -32 -25 -35 -28 -35 -35 -19 -28 -32 -19 -27 -34 -31 -28 -34 -27 -39 -33 -29 -44 -16 -25 -31 -27 -16 -32 -36 -19 -32 -16 -32 -33 -29 -29 -19 -23 -32 -17 -26 -22 -22 -21 -25 -32 -22 -22 -22
2885 -22 -36 -35 -38 -34 -26 -25 -29 -26 -27 -23 -20 -45 -34 -31 -30 -17 -33 -35 -31 -23 -26 -33 -21 -37 -39 -27 -22 -33 -38 -20 -28 -25 -28 -22 -39 -27 -21 -28 -34 -30 -38 -25 -39 -27 -22 -20 -11 -16 -11 -24 -33 -32 -33 -27 -20
2830 -20 -38 -37 -24 -30 -17 -39 -23 -29 -34 -32 -30 -31 -42 -34 -41 -30 -32 -33 -35 -16 -29 -27 -34 -30 -9 -30 -36 -26 -35 -35 -18 -22 -32 -20 -24 -36 -15 -20 -34 -32 -32 -17 -34 -27 -18 -30 -27 -28 -30 -31 -35
2779 -35 -15 -30 -35 -32 -27 -23 -14 -22 -27 -26 -33 -23 -20 -29 -18 -28 -24 -33 -24 -23 -32 -32 -40 -24 -29 -18 -26 -24 -29 -26 -20 -20 -26 -30 -26 -35 -11 -30 -27 -24 -33 -21 -31 -22 -29 -32 -33 -31 -31 -30 -38 -10 -27 -22 -22 -25 -27 -28
2721 -28 -39 -27 -26 -16 -29 -28 -18 -18 -23 -23 -44 -12 -33 -27 -21 -33 -38 -21 -31 -22 -18 -3 -45 -30 -22 -24 -22 -31 -16 -21 -37 -4 -29 -4 -32 -28 -28 -36 -29 -42 -51 -5 -24 -23 -28 -32 -30 -26 -33
2672 c3J1K2l2jnJ0mKNr%Oj6K8j8%jpRJ1%k1LJ1KjOLj7PRTl8J2J7j1%J0poMjNj6J9rRnMLj4J0
2620 b5klkQljPj5J0j0J0mNj4OJj1L1k6J2lkLjnrK9j2pOjqJ5j7%J2j3J1Pj6J1rJ1nkmpK5k3J8
2570 b2nrMJ3kNoRl3K4j6KkK4k6M1k1j0mKQnlmK0l2L5kl6J8J1lj1JnJK1lLl4K2pJ6qK2m3QJ5K
2521 b5oj0J3nLQTm0J4K0Jj0MKj1J0kRj0lj3J2jQjoOoLkJKmRj2J4j2J3qnjOjpOqOLnOJLjUmJ0
2464 b0j7NJ0nJj%kRkrQlJmnRkNl%Kj6JTnQTj7J6Lkj2jJ2KJj8J0%jMrlKPKkj4J6%K1l0J4qnL
2407 c5J2k0LMrJ6RJ1LjJ78K3j41l6K0J7P4N45m93r0rL5J3O15j75l79p7pJ5R3M75m88r1k2kJ7
2371 A03K19j24j05l9j5J1rj1KkQqj2Rj1Lj4kRKLoj2LJOmOj4Rj5QrK3j8%JJ2pOpn%Llj7J5Opj
2321 inmJ8qPq%qQnk3L1J2k1okJ4k5K9j0PLjk2J8LklkNOloklPpljpJ7lTJ0mrpmJ8JojkRKLj5K
$$ plain form
2672 -33 -22 0 -32 -33 -38 -28 -32 -30 -25 -34 -34 -28 -44 -16 -34 -34 -35 -42 -33 -22 -22 -43 -40 -29 -27 -28 -22 -19 -36 -29 -20 -11 -49 -37 -20 -31 -31 -21 -28 -34 -30 -31 -26 -42 -23 -32 -23 -28 -24 -21 -35 -25
2620 -25 -27 -30 -32 -24 -27 -28 -21 -36 -26 -36 -26 -30 -25 -39 -33 -32 -43 -12 -38 -26 -29 -31 -28 -29 -34 -43 -14 -26 -33 -27 -28 -36 -21 -38 -38 -26 -39 -28 -21 -37 -26 -35 -24 -29 -31 -35 -42 -17 -40 -22
2570 -22 -27 -36 -32 -19 -21 -16 -22 -13 -46 -22 -38 -36 -38 -14 -40 1 -20 -30 -34 -32 -24 -29 -32 -36 -16 -48 -13 -15 -51 -33 -22 -25 -36 -35 -40 -39 -18 -21 -18 -52 -30 -37 -21 -29 -7 -50 -42 -27 -25
2521 -25 -31 -41 -28 -33 -30 -22 -14 -54 -40 -20 -19 -29 -25 -23 -34 -24 -26 -17 -27 -30 -43 -31 -32 -24 -25 -31 -25 -31 -28 -30 -29 -27 -31 -22 -34 -20 -32 -19 -27 -32 -33 -27 -28 -35 -29 -37 -31 -28 -33 -27 -26 -23 -24 -25 -26 -30 -20
2464 -20 -37 -32 -22 -27 -26 -27 -27 -29 -20 -22 -31 -23 -26 -25 -29 -34 -25 -27 -22 -25 -25 -23 -39 -38 -37 -42 -34 -26 -43 -27 -24 -26 -38 -39 -27 -25 -24 -42 -32 -32 -33 -29 -38 -41 -39 -32 -30 -32 -46 -30 -30 -9 -39 -25 -33 -38 -35
2407 -35 -23 -43 -40 -36 -45 -29 -20 -9 -6 -7 171 194 53 17 37 54 128 673 180 90 81 116 129 744 569 190 113 106 121 214 689 201 110 88 86 103
2371 103 322 198 93 54 39 50 41 30 32 30 38 30 18 27 16 19 5 3 12 14 17 11 -1 2 3 9 5 11 -3 6 -9 -1 -10 13 -5 -5 -4 8 1 7 0 -5 -5 -2 -5 -22 -7 -1 -8 -9
2321 -9 -14 -18 0 -8 -1 -9 -9 -17 -9 -14 -37 -6 6 -15 -21 -23 -9 -34 -5 -15 -8 -5 -6 -28 -10 -7 -9 -12 -14 -9 -3 -6 -12 -14 -17 -10 -17 -20 -21 -28 -11 -14 -17 -7 -11 -20 -27 -31 -13 -12 -18 -19 -21 -12 -10 -7 -22 -20
2263 b0QpNj0OjJTmJjqJ4qJjLJ0%j6kJ9j5%PpkONmkoJ3j0jJ1rn%NnQjPqlJ0j2MklQqLOKrNLNj
2202 a4j7J0j2J6MRm4K1J6Kmj5O%lJ1Lk7K0kOnrK6m5L7rKoNmJoJ8j2k3J9K0Nk2PJoOk2J4pJJ1
2153 a7j4LJ0kTJ0j2J6j4LJ5k4J1jpJ2j3JTjOjJQorJ0j7NJMkOJ2qj5mPNLPj8lJ8J1j3j1lkJ2r
2102 c0J9rpj1J7JqJ8qmJPj3lPj0PMJKpRlPrkpRQrRpk0J0J8KjpoPJj3PNj4RjKJ5j3k2L0j3kKO
2046 a9NrjJ3j2l9M8LJlj3NlnJ2mqJ5NrQj2pTOK3k4PLj5K0Rj6rTK2jRpTrj0L5qj5J2LqQj0JT%
1993 b5LJ1j0j1K4j5RrM%JmLj2J0MjmJmRmoK0j8oJ3okmTJ4lj1J6n%kjJj1J6jnjL%TnMmKPmqPo
1936 c0LMNj0qJ9KlJ2j2rK1j4pMQj0Pl%j2L3l2mJ5pJNj2J9j7j2K7m3M1j6Lj3L8J6k1k4J8j3KJ
1890 b8lnj1M3Jk9J3pNmJ9k2J6rlOnmRjk2J5oPNkj2LJRkjomK0p%oNoMkljJJ5j7mRJ0k7K2j1PK
$$ plain form
2263 -20 -12 -19 -14 -24 -18 -19 -18 -17 -21 -20 -21 -29 -15 -23 -22 -23 -20 -10 -10 -26 -28 -9 -24 -24 -17 -24 -26 -20 -15 -19 -21 -27 -14 -24 -25 -14 -23 -28 -28 -23 -28 -20 -21 -14 -22 -25 -15 -27 -23 -25 -28 -20 -28 -25 -19 -17 -26 -21 -18 -13 -14
2202 -14 -31 -21 -33 -17 -13 -4 -48 -27 -11 -9 -13 -28 -22 -22 -25 -14 -11 -38 -18 -20 -14 -19 -28 -2 -47 -10 -19 -17 -23 -18 -22 -21 -27 -9 -21 -44 -25 -5 0 -22 -15 -14 -20 -14 -36 -22 -29 -28 -17
2153 -17 -31 -28 -18 -20 -22 -12 -24 -8 -22 -19 -4 -28 -17 -18 -25 -13 -26 -25 -24 -25 -19 -20 -19 -11 -17 -26 -16 -33 -28 -27 -23 -25 -19 -7 -15 -30 -34 -27 -22 -19 -12 -30 -33 -15 -4 -17 -28 -31 -33 -21 -30
2102 -30 -11 -20 -27 -38 -21 -20 -28 -10 -18 -22 -21 -14 -27 -30 -23 -33 -26 -22 -21 -19 -26 -17 -20 -13 -22 -24 -31 -22 -14 -23 -14 -21 -41 -31 -13 -11 -12 -19 -25 -18 -17 -30 -23 -18 -32 -23 -24 -22 -7 -20 -42 -12 -25 -27 -25 -19
2046 -19 -14 -23 -24 -11 -23 -62 -14 -11 -10 -13 -26 -21 -24 -29 -17 -21 -29 -14 -9 -18 -10 -22 -29 -36 -30 -7 -31 -24 -21 -36 -16 -7 -23 -32 -41 -19 -20 -11 -18 -25 -34 -44 -9 -17 -32 -20 -17 -25 -17 -27 -26 -25 -25
1993 -25 -22 -11 -21 -32 -8 -23 -14 -23 -19 -19 -18 -22 -19 -31 -21 -17 -18 -22 -21 -25 -16 -20 -26 -6 -24 -30 -17 -23 -25 -29 -33 -19 -22 -33 -17 -22 -22 -24 -25 -24 -35 -19 -20 -25 -26 -23 -23 -23 -28 -24 -28 -26 -19 -23 -31 -24 -30
1936 -30 -27 -23 -18 -28 -36 -17 -15 -18 -6 -18 -27 -6 -20 -27 -23 -15 -25 -18 -21 -21 -33 0 -32 -36 -21 -28 -27 -22 -34 -15 -32 -44 -17 -60 -19 -35 -32 -45 -7 9 -12 -36 -18 -31 -29 -28
1890 -28 -31 -36 -47 -4 -3 -32 -19 -26 -21 -25 -6 -28 -12 -21 -24 -18 -23 -27 -18 -19 -41 -26 -32 -25 -20 -22 -34 -31 -30 -21 -23 -24 -30 -34 -14 -21 -21 -27 -22 -28 -24 -26 -29 -30 -29 -14 -31 -35 -26 -16 -43 -21 -32 -25 -23
1835 b3LNj1LKnknjMPOnlkJ3j7%nNLkJ2j0LoQkj0JOMLj2lJ7ojMnOok0J3Pj2N3k9l5J4K0k2J2
1782 b6J8k1j7K1j3K2k5%qkM0M8q5J7Nmj3K7j3Nk3L0j1m%lJ6j5K4jj5Lk5K6JjTOqJ3j8j35J87
1739 B2l2nTNmrJ3j5J0LmOj6J0k2J4K0j0QlkJ2op%pMKnmMLlJ0q%J4olUkLJ3j7ROlpJ8Lj9MpMO
1683 a1j2NqrJ8KPmTJpJ1J%J0j6o%OpjJ9knJj0LMj5QmLlQjmLMpJ5j0pQMrOoMpLOmJ3oj5J0nlP
1624 a8mKJ9j4J1mj5ONMj1j0J2Ljj3J5j4RJ0LJ1k0MkjMomJ1oj5J9mJ0pNj4lJ0Rj0J3j0Nj5J1o
1576 a6KQmRJ0QpoKrRqj3J4mKLj4J3nMpqLJ7oJpKmJ4o%Kj9RL%Pj2QKpJ2kj1J1oTRKNMj3J2pol
1518 iTnOMJ5j5MKjj8J4lMj1J1JUMkjrRPj1lkJmJ2pkLmMoNjJ0MJKNKj6J%QnOk0Rj1K2j3j2J8l
1460 aj3lNJNj0JNKkKlp%POKNmnMLlNj2OR%j1K0l0QJ7Jj2LokMkKolJ1jQk0QnlJ0nOjJJ0lj1Pr
$$ plain form
1835 -23 -20 -15 -26 -23 -21 -26 -28 -33 -34 -30 -23 -17 -22 -25 -27 -14 -31 -31 -36 -31 -28 -30 -18 -28 -25 -31 -23 -25 -35 -34 -28 -24 -21 -33 -36 -19 -25 -26 -22 -27 -21 -27 -47 -34 -27 -39 14 -15 -50 -36 -16 -38 -26
1782 -26 -8 -29 -46 -25 -38 -16 -41 -41 -49 -51 -11 37 -48 -31 -26 -30 -43 -16 -29 -24 -47 -17 -28 -32 -32 -35 -19 -34 -10 -11 -26 -23 -48 -22 -21 -22 -23 -17 -25 -12 -30 -165 22
1739 22 -10 -15 -20 -15 -19 -28 -15 -30 -20 -17 -21 -15 -31 -21 -43 -29 -9 -19 -11 -14 -16 -4 -10 -17 -17 -24 -20 -18 -23 -27 -23 -20 -23 -13 -21 -21 -7 -13 -16 -19 -22 -24 -21 -8 -25 -16 -10 -13 -20 -2 1 -18 -14 -21 -17 -11
1683 -11 -23 -18 -26 -35 -17 -15 -8 -12 -16 -15 -22 -11 -10 -10 0 -16 -22 -22 -16 -23 -24 -5 -7 -12 -11 -21 -18 -14 -29 -21 -25 -22 -25 -17 -18 -22 -19 -15 -22 -7 -17 -24 -16 -12 -21 -15 -21 -17 -24 -21 -15 -19 -6 -12 -27 -17 -22 -25 -18
1624 -18 -22 -20 -1 -15 -4 -8 -23 -17 -12 -8 -19 -29 -17 -14 -15 -28 -13 -27 -18 -8 -5 6 -14 -10 -12 -13 -9 -15 -19 -8 -14 -29 -10 -14 -4 -11 -6 -20 -23 -13 -4 -14 -1 -11 -6 -21 -10 -16
1576 -16 -14 -6 -10 -1 9 17 10 4 6 -3 6 -2 -15 -1 -5 -3 0 -14 -1 -6 -2 -9 -17 -14 3 -3 -2 -9 -7 -11 3 -3 -3 -1 -20 -11 -8 -8 -1 -13 -5 -3 -10 2 0 -11 0 -6 -12 -3 -1 4 8 -5 7 0 -6 -9
1518 -9 -9 -14 -8 -4 11 -4 0 2 1 -17 -3 -6 -2 -13 -2 -1 0 1 5 3 2 -7 2 9 -2 -5 -7 -6 -10 2 -5 -7 -4 -8 -4 -10 -5 -6 4 8 9 11 16 18 2 3 3 11 6 12 -8 1 -10 12 -1 -13 5 2
1460 -1 -14 -17 -12 -11 -6 -16 -15 -10 -8 -10 -8 -11 -18 -18 -11 -5 -3 2 -2 -7 -3 0 -3 2 -10 -4 5 5 -6 14 -16 -8 9 10 -2 1 -5 -7 -3 -5 -3 -9 -12 -1 -2 6 -14 -6 -11 -14 -4 -9 -3 -4 -3 7 4 -7 0 -9
1400 i%J1nNljLTj5jJ0j1NJ0JpomRpJ0KPjpKLrpRMjj2J3j4J4j7Q%TJkOjKoQJ8J7R1J08k7j21
1347 H6n6nMj4Qk1J5qjj1jJMRPoNj1%Nj2KkLj6L3oK3m8K1J%k1K7Lj0NK0l9QMj7R2r2P2Ko8J4
1299 Ij4kM0m3ON2j5jk9J6oJ4k3MK4rj1j5LJ0KMj0j9J9QlJ1k2MqORj2QmJ1MmqojqRKLJJ4QJ0
1249 C8n1PM9l8rQpL%J1Mj8nK9j6JpQNJ3L2n3L97k12j28J9n3PRpMkqnjNj5J2mJ4%lK4LK0m0ml
1201 C3J1j4K5j5N5PK2M6o9L0kP1J04j46K778j945j18m7M25N89K009K519L571L0618j8222
1176 B2335j6673j906r74r25j94k19r2P1J584j980o2p9j38o7j2M6L6k9p4p7k2m9j1l0rnQm2P
1147 D18o6mj3k1l7kj2Nkqoj2k1lj6%K5N6m5K44k35l4k2j0k0omqj3J4qk1%Rj0jj5J3j1mJ0J7
1105 A21o6OQpJPnj3Mj3rJ5Kl%oJq%TrJ8LKqJOj4j3loKkMJ3L2k6p%j6NQj3K0L5l4m8O5m0lKj7
$$ plain form
1400 -9 -9 2 -3 2 -1 -2 1 4 -11 -12 -2 -13 -8 2 3 -4 -10 -14 -5 -12 -2 0 7 6 -1 1 4 -5 -12 -3 1 0 -12 1 -13 1 -16 -8 -8 -8 -7 -9 -3 -4 -2 -8 0 18 35 126 234 207 86
1347 86 30 25 29 15 23 2 17 9 8 -3 -4 -3 1 10 17 11 16 5 5 10 -2 0 -2 1 -15 18 12 35 -13 8 9 9 -12 15 18 8 13 33 -6 2 6 -11 81 -11 61 63 -5 9
1299 9 -5 -7 33 -10 -4 48 33 32 3 19 13 27 4 8 32 23 12 -3 0 10 12 16 6 -13 6 14 11 22 0 4 -4 2 11 -1 7 3 14 18 14 6 0 -1 -9 0 2 5 6 20 28 38
1249 38 -13 -6 43 5 -4 4 -3 0 0 11 15 -3 -8 21 5 6 -1 7 12 25 57 4 401 189 61 80 27 34 43 36 40 38 30 25 24 29 14 26 22 36 36 33 57 60 80 40 36 33
1201 33 44 30 55 40 95 102 124 170 101 131 129 200 304 158 2936 991 873 826 1251 1840 3849 6368 9939 40557 22335
1176 22335 5662 3756 2782 1857 1663 1444 1352 1423 3007 1027 965 886 748 681 669 715 751 722 648 571 549 500 489 459 450 445 453 411 418
1147 418 352 348 335 314 277 275 263 268 266 258 252 240 219 216 200 200 225 281 236 480 245 211 189 179 159 153 149 141 128 142 134 113 113 122 112 111 96 109 98 94 104 121
1105 121 55 61 69 62 63 70 65 52 56 43 34 49 51 48 48 42 43 35 35 35 26 44 47 49 41 42 48 34 21 18 12 14 12 16 29 61 35 28 28 12 17 25 12 32 67 33 -15 50 10 7 9 -8
1053 hN6K8q9Q7p4J7oj2MK2j9J0K5o4K8J4j0j6L9l0N3q4L2nKljJnJ7kTj0lMT%Mj2JNOj8J2Kj
1007 aJ1J6L3J28N5j00q8nk5kqmRLkj2Nj2jPTnj1MTkmLkPj0KUpJ0%j3QjOpKkj4J8Oj0JnK%K%m
952 dTQlJ0j3OkoJlTJ7jj0Rj2k%KNLlMJ0pj9J0Tj0nJ3knLJ7l0J6%j6LjJ1PJ5j7KJ8k2j5J1J4J
900 A1qnJ2j6M7m9nNpJ5J4k1RNnkk1J3MRk0k9L6K3j6LkLNmpJ9Ok2%TpJ2K2j9j8NKlpOoMQJTPq
847 @%J1k4KQOJj4KjRO%j8OTpnLNLnkJ5j1pKOlNj2J5kMrlMJ2Jk3QTrKPOkJ0jj6j4J0pJ7J6Rl1
790 anJ7j1j7NQ%j1j3j1N8k1NqK8J5l8LrolJ6pJRkm5N9Ok1J1j8lmJ3J4k8mJ1jL%nJ8JrKJ2Ol1
740 a1%QpK1N%l1RjJ3k5kJ3NMjqQ%NqpNLJ1lj6PpJ2%Qj8MKTOPj1JpLJ1oTrPrMJ7nj0J4qkLkTj
681 eMqOjmOj4K3oTQkopK8pnj6J7mlnPRlJ9lj6j1J7k0J0J1j8JPOmj2J3kKJ3Mk1j1jJ4k3J8KPj
$$ plain form
1053 -8 48 76 -13 74 0 17 11 -1 3 25 6 16 41 -23 5 19 9 -7 32 2 55 -29 3 -2 0 -3 -4 -3 -8 9 7 5 -5 -8 -4 0 0 4 -8 -7 -2 4 -14 -2 0 -1
1007 -1 10 26 59 187 242 142 54 49 24 22 14 10 19 22 20 8 13 1 0 7 14 9 -2 2 6 4 0 3 1 8 -2 0 2 4 -3 7 7 -6 2 1 7 0 2 0 -14 4 10 0 1 -4 -2 -2 0 0 -4
952 -4 -4 4 1 11 -2 4 2 -4 -3 -6 -9 8 7 -3 6 -6 -8 -8 -6 -1 2 -1 3 13 6 -13 -3 7 -3 -8 5 3 -2 1 18 -12 4 4 -12 -9 -10 1 8 23 6 8 26 4 -11 0 14 15
900 11 3 -2 10 -6 41 -8 -13 -8 -15 0 14 -7 2 7 2 0 -21 -8 -4 5 -15 -44 -8 15 -1 2 0 3 8 4 -3 16 22 0 0 0 -7 5 27 8 -10 -5 -3 -6 -13 -7 -13 -9 -1 0 1 8 0
847 0 0 11 -13 -11 -3 3 4 -10 -8 -9 0 6 6 -12 -6 0 -7 -12 -9 -4 -1 -6 -8 7 -4 -11 -9 -3 -6 -1 -13 2 0 4 -5 -8 -4 8 9 -14 -6 2 -7 -5 2 8 6 16 15 -1 -15 -5 -12 5 21 30 -1
790 -1 -6 11 0 -17 -12 -4 -4 -15 -28 -39 19 -2 3 -5 23 38 0 3 -6 -12 -15 1 -6 -5 4 2 -43 16 22 1 12 -6 -9 -13 0 14 -14 -18 -7 -8 -5 -5 -10 8 9 0 2 14 20 -11
740 -11 -11 -3 -10 11 16 16 -15 -6 -7 6 -19 -21 -8 -3 1 0 -8 0 0 5 -3 -10 -5 -2 9 6 -10 -3 -10 2 2 10 -8 -4 -2 0 6 13 2 3 -4 -1 10 4 -2 -11 -4 -13 -9 8 3 -7 7 -1 -3 0 -2 -4 -5
681 -5 -1 -9 -3 -4 -8 -2 -16 7 1 -5 3 1 -5 -12 16 9 4 -12 5 1 -2 -7 0 9 6 25 22 6 -5 12 -8 2 13 -5 -4 3 9 5 -7 6 4 6 19 23 2 -9 -10 4 -19 -1 1 8 7
628 GTLk4N%Rj1J3kJj1K1mTM5l6j9J1lqQoJ7JQj1nLq%PTnk6K1lOoJ5j0Q%Nk3Pl0K1J2j2J2%o
576 aJ5kj3rkRPj5J9j2MkJ0qNnTPkJ5j0%MLnlnJJ6jpqJ0pl%J0KNrMoTrRj0J6kMJ3lj4mLQj0rM
518 dQJJ0j2jkTNljPKjrJ6qokJ4mj3QLnLjLKJoNj0J5MmrJ0KOj5Oj5J0pjJ0kJ2j9%TJ2Jm%okL
460 Ej0J6k1J1J0Lj0Oj0Oj3J8p%mRmJlMRj2MJrJ0NkJj0ROnKlrPLOj2NJj5J3JKo%J1rj2J9j5pP
405 CTNjj4J6JjJj1KJRpj0J5mlJ%Mmj0Qjp%TQOj0j8L0j2JQqNj0LJoKK0rjPrkqoJ5MPj2J2rj%k
346 FLj1J6J0oj2jlK%JNoL6k2mJ%onj0QJ9j3J8j2rJ0lpK3Kpj1Qj7LPLKJj3Pk4J3K0j6mJ9j5o
295 @J2Mj6J2%J2lT%nj2J2lkJ1mKLj3J6j6pJ0kJ1qJ%J0j2NLpQj5J3j1QJL%J0j6OnPj0Jj%LTK
242 A8j4%QJ4kqNLj3j1QnK7k6L0j1qMj2nRoOJlj7K9j5J7rNj5J8JK0l3j2qJ2J7j0qM3m0J5lLl
$$ plain form
628 7 7 10 -14 -9 -9 0 -11 2 0 1 -10 11 7 3 48 12 -7 4 1 -7 1 -5 12 13 21 10 5 8 0 0 7 14 9 -17 4 1 7 1 16 6 14 14 19 -4 3 -27 -6 6 -6 6 6 0
576 -1 14 12 -1 -10 -12 -3 4 -11 8 -4 0 -2 8 0 5 0 -5 2 0 15 5 5 9 12 7 4 -1 0 16 15 8 0 10 3 0 0 10 12 17 8 12 6 0 -9 0 -10 6 4 8 21 18 4 0 3 11 1 -8 -4
518 -4 4 5 15 3 2 0 -2 3 0 -1 6 8 7 -2 14 6 0 -2 12 8 -5 3 6 1 4 3 6 8 9 3 8 -2 13 17 13 4 14 16 22 7 13 -2 8 1 0 10 8 20 1 1 1 13 14 10 10 4 2 5
460 5 -5 11 -10 1 11 14 4 10 0 6 -7 11 4 4 0 9 5 6 3 7 16 4 8 9 0 10 15 13 14 4 13 19 14 16 13 4 11 14 20 8 13 14 -1 12 13 15 9 9 20 11 -1 18 3 -4 3
405 3 3 8 7 -7 9 10 9 10 -1 1 2 11 4 -6 9 5 2 3 3 7 3 -7 1 0 -7 -7 -7 1 7 -3 -21 9 -3 -2 6 -2 3 -7 -4 -3 -9 -7 13 4 3 10 1 -1 -9 -15 0 4 11 -1 11 2 1 1 -1
346 6 9 -2 14 24 18 6 5 2 4 4 5 10 4 40 18 14 15 15 9 4 -6 2 21 8 26 14 5 15 12 5 28 30 23 12 20 3 6 13 16 18 19 6 13 -11 2 22 6 2 21 6 0
295 0 12 16 0 12 12 24 21 18 18 13 1 13 10 8 19 15 17 20 7 23 7 0 10 8 19 11 12 12 22 10 15 18 11 19 4 17 6 14 15 18 18 28 12 18 13 20 10 11 10 10 13 16 18
242 18 4 4 12 26 24 16 21 24 11 0 8 3 30 4 34 23 15 19 7 2 11 5 11 12 9 -8 21 6 23 14 19 4 22 23 43 10 -2 -10 2 19 9 1 44 4 19 16 19 16
194 A6j2J3LMJ3j5m3K8K1pkjomJ3%ml1L0J0OqJj9k1L4joKMKOLnl5J2K4jrJ0Ol0J1Plj6OTJ9k2
144 IK2qj4RJ0j1OqMlKmNQmLkoj0K1%pNLMj2J1j4oJ2kMJ8j8Nqj2JPjPj3JK3oj9kMJTJ5rRj5J1
89 B7qoJ0Mj1LNjrNJ3l%j3NJpJ3Kj1mQJ1Qk8OJqOJ4lj1Nj1JJ9j5nJ8j1jJ2lklk4K4MTRk7J0nL
35 B1lNqQLm%Pj6PJ3j8jJ0jTJ0%jTlMJj6QMnkJ6jpKmlo
$$ plain form
194 16 4 17 20 24 37 22 -21 7 28 21 19 18 12 8 21 21 17 -14 16 26 32 24 25 6 -15 19 18 12 14 18 20 26 29 24 -11 1 25 24 15 25 31 1 12 19 16 0 6 12 31 9
144 9 31 23 9 18 28 17 23 15 19 16 18 14 19 27 23 26 24 18 8 29 29 22 27 30 34 22 33 19 13 25 23 27 45 27 32 24 12 13 20 19 26 13 14 37 31 12 10 14 15 16 31 22 31 16 27
89 27 19 13 23 27 16 19 24 23 14 19 32 29 29 16 21 22 15 28 30 19 15 23 34 42 14 20 21 13 19 33 30 19 24 13 14 33 18 13 31 20 19 31 28 26 23 -1 23 27 31 40 13 23 18 21
35 21 18 23 15 23 26 22 22 29 13 20 33 15 14 24 23 22 32 32 31 30 27 31 32 16 24 28 23 21 37 36 29 31 27 24 18
0 A8
##PAGE= N=2
##DATA TABLE=(X++(I..I)), XYDATA
8191 F8roOj2J2j5lMj3QJOojM%lKOjnkMPj1J4j6j1J0oRj7K5k1J8qkORkNlpK2k5K4j1kTj0Rl0L
8138 B2J9j8J4pmK2rJQolTRqJ9j6P%nQMj8J1jrJ8k3K0j0J3j3%LJ8k9J5mKk9L6lKk9J5pJ4jj4O
8089 C7oJ7JplLpNOqlLJ6j7jJ1pj1J5mMj0kK2j4P%oq%J0JrNmKrJ3mKj4J3Lj2MK0k6RQ%lj4K7r
8035 D6j0nQqJ1qJ1pJ1j1KlLlKlNj3J8pj0jJ4pRo%KNMr%Kk%TMomK1j1j7J2rjL2k2Oq%orL1mk2
7980 B7QMmj5J8k2L6jK3j2qj4%j7K8oj5O4j38J51m4k1J1j4O3o4kQj0K1k3KrK1pL9m1Q3n2Kk8k
7938 D0K7k1nmN2n9J0%Nj5%K8Nk1j7LJ9J2pj0L%jMj1OqJ4km%PlqMQj3KLTj1J5Rj7jj5J4OojpP
7886 C9OjmkLNJoJ0l6K3J3j8JTJ8j9lJ6J2k4J3lj7j3Q%NK5Kj6j7J0NonNJ6M4r0oJ54r2jk5jK0
7839 E0J9qn6K13k80J50k9qk1J15k48K58o5qj5J9m1Rj3K3J8r0J42o4j9Mj1J7J6l2J0jJ1k3j7
$$ plain form
8191 68 59 53 59 47 59 44 41 45 32 40 41 47 41 40 44 44 41 43 49 48 43 41 45 52 41 55 39 28 38 32 41 24 49 28 46 38 36 42 51 49 54 51 44 66 41 65 54 52 50 40 49 19 22
8138 22 41 23 37 30 26 48 39 40 48 42 39 36 45 37 56 40 47 47 42 50 54 36 47 46 37 55 32 52 42 55 42 42 45 63 34 49 45 47 18 54 51 53 24 39 32 46 45 31 37
8089 37 31 48 49 42 39 42 35 40 46 38 35 38 54 37 36 47 40 29 44 40 44 34 32 54 40 47 47 41 33 33 43 44 35 40 36 38 29 42 38 40 26 39 42 30 34 54 28 37 45 45 42 28 55 46
8035 46 36 31 39 31 42 34 45 38 49 38 40 37 40 37 39 36 41 28 46 39 29 28 42 35 44 38 38 40 45 49 40 40 42 40 40 40 44 38 34 55 44 27 39 30 29 61 39 45 37 37 31 22 53 49 27
7980 27 35 39 35 20 38 16 52 51 74 62 54 40 40 23 51 45 30 94 -44 107 63 42 53 39 102 38 36 44 34 55 32 34 25 46 39 78 37 120 68 70 42 40
7938 40 67 46 41 37 89 30 40 40 45 30 30 58 63 42 25 28 47 59 52 42 45 45 44 48 37 43 35 49 47 43 43 50 47 39 43 51 38 40 43 46 35 50 59 42 41 26 40 46 40 39 32 39
7886 39 45 44 40 38 41 46 47 41 51 15 38 51 33 34 35 53 34 31 47 59 35 48 45 28 15 23 23 28 53 55 39 22 32 37 31 26 31 47 91 1 -5 149 57 56 31 30 50
7839 50 69 61 5 218 -62 88 59 51 30 145 -103 155 90 82 67 86 45 54 41 64 82 -8 134 70 51 55 44 61 77 45 55 54 65 42 25
7804 B5K2Kj5K6K1m5lPTRj3J0pmJ5rNKj8K1j0kOjKJj2OljJ0qRpOj7QkKQlpoNJ4Jplp%QLj7J6j
7749 D9KJjqMj1NlnJ8Kj2MpJmMLK1k5oJ4nLMjj9J6pK3l4%RJ7j9K1Nk2LTKRl1K4j5J5J8pm6L1
7699 D3j0K1j2J4j5j3K4LJ2k1j8J3MpJ6j8J0%jOj4kJ4mpJ2lJ6k5J8rmPqPj0%J9j3j0J6mJJ0j2
7654 D6pJ3J2k5lJ0pJ8mj9RjkTJ2ljj0RjTnJ2q%OJKj5J0Moj5PJ8j2J5k2OMNlMj3Q%TLToj%Pk7
7600 B5K6kTlKJmJ5lj2J3rjNMpmL5k6jJ0oJ1j9nQJj1QpQLpJ0Jj5O%lnJ0kRQj7J1rJ7j3PLj0p6
7547 b2P3J4rJ0j6nK1k6Qqj5M0k7KMJ0j5k4L3PKTkj8J1MLqTPJlpPJ7rj4K0%oj1J1jpJ4Qj6lJM
7497 E4Tj1nRkRl%j0J5j4Kj1J6rN%J5k0%QpOkjj1KJ8rRj2JTj1J2J7j5j3LJ2Oqj2lQNj0J6KpRn
7445 E3qK7mk2J0j6qJ8L%j1J4l0J7L3k5k0L5mKj4J5km1NN2l4mKJ6j3K5j9JUompK4j0k2K6rJ0l
$$ plain form
7804 25 47 49 34 60 81 36 33 40 47 56 43 53 46 42 57 48 53 55 37 58 48 46 52 51 53 54 42 48 45 44 54 46 55 48 54 37 45 43 45 53 50 43 37 42 56 57 50 47 40 40 48 51 34 50 49
7749 49 51 52 51 43 47 36 41 38 33 51 53 41 45 38 39 35 39 42 63 38 32 46 41 44 48 47 28 44 37 60 26 26 35 52 33 54 59 37 40 43 45 54 23 47 32 47 65 58 12 43
7699 43 33 54 42 56 41 28 52 55 67 46 28 41 45 38 54 36 46 46 45 51 37 35 49 45 38 50 47 63 38 56 47 43 50 42 49 39 39 58 45 35 51 47 48 58 46
7654 46 39 52 64 39 36 46 39 57 53 34 43 42 40 38 50 47 46 36 45 44 43 38 50 42 42 48 49 51 36 46 50 44 29 36 54 42 57 35 41 45 50 47 51 38 46 46 46 49 52 46 45 45 52 25
7600 25 51 49 47 44 46 47 43 58 55 43 56 47 46 51 55 48 44 79 53 52 62 56 67 48 43 51 52 41 49 42 50 53 46 56 57 42 48 48 45 40 50 48 57 65 48 59 50 67 54 61 64 54 -22
7547 -22 51 65 56 66 50 45 66 40 48 40 25 65 38 40 44 54 39 15 48 55 57 59 57 39 50 54 57 49 41 48 49 46 39 46 63 54 40 60 60 54 43 54 53 46 60 68 52 49 50 54
7497 54 54 43 38 47 45 54 51 51 41 56 42 44 33 49 40 45 45 60 40 40 48 41 47 45 44 33 35 53 44 53 41 42 43 32 44 61 46 33 36 48 54 46 34 31 39 44 34 50 52 45 54 49
7445 53 45 72 68 46 56 40 32 50 53 53 42 56 26 43 76 51 31 66 62 64 50 65 63 22 27 79 45 41 43 59 46 71 52 53 54 55 49 45 38 62 52 30 56 47 57 54
7399 E4mRjKj3mPJ7j9J7k1%J0kRj3PTk3J1Qj3MRjolPj1TJ9j5QJKJJ4rOo%j1MPJ2k1KmJ4nNTj4
7346 D8J0lp%JoOjKJ2oKj1JLJ4j7LoJNTJ3k3oQMlJ2nk0J3NmlknJKK0nj5KJ3j0Oj0M%NJ1J2k5K
7292 E3kJjMKrK0kj3jTJj3J7Oj4QNqoJ0nTQJ%mLNj1RoLqKNk0K7qj2K0j8J5lknJ3j2J3j1J4j9
7240 D6K0k9RJ1Nj1PTlNj5lJ2Jn%KJ2j4J2Kkj4rJJ5mQKrTJ0oLkj1KJ3J1%k0lOnPqKJJ2J0k1ml
7187 D4J6j8K1Pj0j1P%OmlMjLJ3k6QoLJ2kMJ0j7RMqj1QrJ8j1lnmPJ0pkQloJ3jLlj9jJ0K0k1NJ
7134 F2oLJ4j5JnjQKkNTojpPp%J3%j8J5kj1kQpLPJ4qj5NLnMlMloJ2Qj4lJTpK3Jj7jJ1Jj6K2j1
7078 F4rJ7J8j8TjKJ3mNpMKJ1j7j3J2MLJ1mrqOTrkMJ5j3nJ0rlJ7j4OkJj0QpJ3jnj0J2MPj0j1P
7026 F3Jj2J1J2LqJMk2K1JO1q8rJ0J6oMOJj0J6k0OJ0k5J8jMj1J2oMjMlnlJ4j0Kj0lJ3LrNK3j7
$$ plain form
7399 54 50 59 58 60 47 43 50 67 48 65 44 44 54 52 61 48 55 62 39 50 58 45 49 58 57 51 48 55 44 33 52 37 45 46 48 49 63 54 60 54 54 43 47 54 66 45 47 43 57 52 57 62 48
7346 48 58 55 48 48 49 43 49 48 50 62 56 58 47 48 51 65 48 51 45 46 51 56 69 46 40 48 52 49 61 56 36 49 54 50 47 45 40 41 43 63 58 43 45 58 48 54 44 48 48 53 64 76 51 53
7292 53 51 52 51 55 57 48 68 66 53 52 51 52 39 56 62 48 56 61 53 47 57 52 47 55 56 56 52 55 60 49 58 52 55 47 49 54 34 61 53 41 61 43 58 55 53 48 61 49 62 51 65 46
7240 46 66 37 46 57 62 51 58 65 62 67 52 49 61 62 57 57 59 71 57 69 71 69 55 46 47 62 58 66 68 59 50 60 54 57 55 44 46 59 70 70 50 47 53 48 55 47 49 50 62 72 51 47 44
7187 44 60 42 63 70 60 49 56 56 62 58 55 59 58 61 74 48 56 50 53 65 63 67 77 60 69 73 65 54 62 53 71 60 57 52 48 55 65 58 56 64 61 55 68 67 70 67 48 47 57 77 56 61 62
7134 62 56 59 73 58 59 54 53 61 63 61 66 71 65 64 57 64 57 57 70 70 52 67 65 54 52 60 53 56 63 77 69 54 59 62 57 61 58 62 59 53 65 73 59 56 57 58 51 74 75 58 57 68 69 53 75 64
7078 64 55 72 90 72 54 53 55 68 64 69 62 66 68 79 62 49 61 65 68 79 75 66 58 64 70 61 59 63 78 65 60 70 61 58 75 61 67 65 66 56 64 57 70 69 64 54 66 70 77 67 56 63
7026 63 64 52 63 75 78 70 71 75 53 74 75 136 48 39 49 65 59 63 69 70 60 76 56 62 72 47 65 64 68 57 69 63 67 66 70 67 62 59 73 63 65 55 52 65 68 59 64 87 70
6977 G0pMnNnKnJ0Mj1kQLj5J5nJ3j3njJ2j1R%jnKPNj8Qj4L1rKoqJ0KrjLnQkTjOlJKlQKj3J2j3
6920 F6kR%mQqKLNk0RPj3J7j3J7rj6K8j9Mnj%PNJ2j5L%nPrTJ3%Jj1lJ1kKM%J1lj2K0k5OoOMRq
6865 G8pRkMrNj1J1rJ5qlj0RTj5%K3j1Oj2PqPj5QPlkQnJlpOJ9rmLpj6OMJ1j1J3kolK0nj6qJ9M
6810 H5J4k0jLqPlLTQmj3QmKj1OlLJ3j2OnKjJmTLJ5j3MOj6%QoLqKMjJ6j4J4lplRk0J3lp%NO%K
6752 H0k%J3j0TRp%O%Rj0MTj8K1jKjmrmJJ3omLOoNn%mKkNJ1qlLKmLmPJ0j5J7k1J0noJ1j1MJ0o
6695 H5lkpOTkLnMljMqPjNj1qJ7j1MKjmJN%Olj2RnJ1k1MJ0OjlPj0NjTlRj0NKj4J5KrnNlJ6pj3
6636 G3J3rOJ0oJ0j0Ok8K1k8L6l9L4njqJ5k4J0MQj6L3k3j5K0l8L2Mk2N1j4mKl1RJ9l9L0KK9j8
6593 I9j2LK6k7k0K3MTNpkTjkJjNRoKlP%MnolLlJ0k1J8kKlj0QMjLMjJnkokNoOP%nJLnoRlQjMJ
$$ plain form
6977 70 63 67 62 67 62 64 59 69 73 62 60 68 71 56 71 66 79 66 61 60 72 61 70 70 69 64 66 73 78 60 68 54 85 76 78 72 64 74 76 67 66 69 64 72 70 68 67 73 70 71 73 70 78 80 67 79 66
6920 66 64 73 73 69 77 69 71 74 79 59 68 75 62 79 66 83 74 58 86 67 71 66 65 65 72 77 89 74 77 77 72 79 70 61 74 74 75 64 61 72 70 72 76 76 87 84 72 92 67 73 67 73 77 86 78
6865 78 71 80 78 82 73 78 67 78 69 84 76 73 63 72 81 66 66 89 78 84 72 79 71 78 63 71 78 75 73 81 76 77 74 67 73 92 83 79 82 75 59 65 69 80 69 82 80 74 71 91 86 70 62 81 85
6810 85 99 79 78 81 73 80 77 80 83 91 87 74 82 78 80 69 75 72 75 88 76 82 77 79 78 79 75 71 74 89 76 80 86 70 70 78 72 75 67 69 73 72 88 74 88 85 78 75 84 64 77 74 67 67 72 78 78 80
6752 80 78 78 91 81 71 80 73 73 79 79 88 78 82 86 68 89 88 90 89 85 76 72 73 86 80 76 79 85 79 84 79 79 75 77 75 80 91 83 80 83 85 81 84 80 87 97 82 99 78 88 83 77 88 77 81 91 85
6695 85 82 80 73 79 85 83 86 81 85 82 81 85 77 84 83 88 77 69 86 75 79 81 80 76 77 82 82 88 85 73 82 77 88 67 71 81 87 86 83 90 80 85 84 83 80 89 79 84 86 72 87 89 80 75 80 77 93 86 73
6636 73 86 77 83 93 87 97 87 93 65 86 58 94 55 89 84 83 75 90 66 76 80 88 72 105 82 67 87 49 81 85 63 114 100 96 98 67 76 95 56 86 88 117 99
6593 99 87 90 116 89 69 92 96 100 105 98 96 94 93 91 92 91 96 105 99 101 98 105 105 109 104 98 95 98 95 105 84 102 100 102 99 89 97 101 100 103 107 106 107 102 100 94 92 97 91 97 104 104 99 100 103 98 92 101 98 106 105 109 110
6530 A10kj3MPopOj0J4qjPNmpTJNTr%nRPKoj4J4Ok6jK1k0K2j0Qj2JTK0J3j0J1m2K7j5kk3mk7
6480 C5J07rRrj3%lj3OTk6L2Rj6Oj9J0J8rK0j5qj0J7j1KnOKq0O4J8J1lpmj1J8k6J4J6nmkJ2%
6434 A30j2MnojOrJ9jTj0LJ0pkjmlJ0klmKLj3RKOmjJ0rJ4pNj1Lr%J1j3Ro%J9pmJ1k3KJ8poJ2P
6379 A34j9Rj3Poj0K3oJJ1j1QJ0k9jJ0%RJJ1qkj1NJ8k5J9lJQj2rJ2poJ9oknK8k9Qj9M6k3Mj3
6332 A27J5qKj0j8K2K1j1Pj2oJ4j0MkLkJ8j2lmnk2L1QRj0lKk0J2%j0MJ0Tlj2Qj3J0lJ0Kj4Lql
6284 A28J7JklqNMj0QLlmQj3J9j3LRj2OPrO%mOj2MO%lRjMj3OJ3j1TRJnJ6j4oJ5OKj3oRoJ0j1T
6229 A36K5kKNpqj1K4J5k7MK8Lpj1j8RK7j5k4j1J9LoLJ0K5J0Nr5L6K3rJ3Ql0jnKJ8J2K4l0QJ2
6184 A92J6j7n5L2J5k4%J5m%OpK1j7J5j5%mOK1Rj3j0lK4k4km%KJQmj9L0lj1jTKOmQj6NRJ6j3r
$$ plain form
6530 110 108 95 99 106 100 93 99 89 103 95 94 101 106 102 95 88 89 94 99 90 90 85 94 101 103 97 83 97 103 77 76 97 77 99 89 97 85 86 87 107 120 110 121 79 106 91 89 66 62 35
6480 35 142 133 142 133 120 120 117 104 110 116 90 122 131 115 121 102 112 130 121 141 126 118 108 125 114 116 111 117 119 39 103 121 132 129 122 118 107 125 99 113 129 124 120 118 130 130
6434 130 118 122 117 111 110 116 107 126 125 124 114 117 127 120 118 117 113 110 120 118 115 111 113 116 103 112 114 120 116 115 125 116 130 123 128 117 120 111 111 122 109 118 112 112 131 124 120 131 108 110 128 121 115 127 134
6379 134 115 124 111 118 112 102 125 119 120 131 120 128 138 109 108 118 118 127 128 139 131 129 118 123 141 116 135 132 133 141 129 120 132 125 119 138 132 130 125 153 124 132 113 159 136 140 127
6332 127 142 134 136 126 108 130 151 140 147 135 129 143 133 137 135 138 136 154 142 139 135 130 108 139 147 156 146 143 145 125 137 137 127 131 141 151 148 136 144 131 141 138 148 150 136 139 131 128
6284 128 145 146 144 141 133 138 142 132 140 143 140 136 144 131 150 137 140 149 137 143 150 141 147 147 143 149 137 141 147 147 144 153 152 156 143 149 162 151 140 149 150 145 161 147 141 156 162 164 151 145 154 148 158 147 136
6229 136 161 159 161 166 159 151 140 164 179 152 156 184 187 180 169 151 160 187 172 148 137 156 159 153 156 166 191 201 206 111 147 170 161 174 182 152 151 146 148 166 178 202 172 180 192
6184 192 208 191 136 168 183 159 159 174 170 170 176 169 190 173 188 173 173 169 175 196 205 192 182 179 203 179 177 173 173 175 176 184 180 161 191 188 177 176 175 177 183 179 187 171 176 185 201 188 179
6135 A79jP%NplNMOMj2lTK0pj1RkQj7MOTJ0oj2J2NrmrJQJ9Mj4Nk1J4RpkQMRj2olJ6Pm3J8J4J0
6081 B22k1JqJ7RmJTk8K4kj5J2M8n9JJ9lJ8Lj9MjRk2rM4j3%j1%jK2j3MkRmj1rK6k1K3jj7nmj
6033 B13K1lJ2k2LJ6npLKLJoMj8K0mQJ4J1j1j7pkQMjOj4K2Qj4oQKNj2Pj0LjmJ3pNj3MK0j4jj0
5982 B37J1Mj0Kj0J2%JjMJnJ0JpoQJ5olJ0j6oJ2J3Jj6KJjJ1jkj0NQKj4J3j0JK5j0kj5J8kj0ol
5932 B56K0%Pkj8POpJ0rJ2%J1p%nJ5oTKj1J0MTJ1NRMrk1J1rPK4mk8nJ9k7MJ2ojJ4r4M8P8nTO
5882 C31J1Rj6JMJ7kk3LMJ1NMl0j6LJ3RNJ8K3M1o1p1J5J7KK0pN7j30M3K0RJ0K6P7k02M8QJ1K6
5840 C43n3K4PL1kJ4MO4r3j12M7K2J0JMJ5Nok9RJ4KK0Rl0K2ql%MJrJ2NJjpMJ8nMJJ9j1MKRQjr
5790 C80J5j7Nj5K0qJ0nJ2OMrP%Qq%K1Jj4JjK8j7J1j3J8J1K3j9qj3J1OkKK3oMNLOTJ0K0o0J3T
$$ plain form
6135 179 178 185 185 190 183 180 185 189 195 199 187 184 181 201 194 183 192 190 198 181 185 191 197 207 201 189 201 206 197 193 184 185 193 212 216 202 207 186 200 209 202 200 208 212 221 209 203 200 216 223 180 198 212 222
6081 222 201 202 194 211 220 216 217 218 190 214 212 197 209 257 198 199 218 215 233 236 217 221 220 229 207 198 242 229 229 218 218 217 239 226 230 228 237 233 222 213 239 218 241 240 223 218 214 213
6033 213 234 231 243 221 224 240 235 228 231 233 236 237 231 235 217 237 233 241 255 266 255 238 231 229 237 241 240 246 232 254 262 248 242 250 252 257 245 252 242 245 244 240 253 246 251 238 242 262 248 247 237
5982 237 248 252 242 244 234 246 246 247 246 250 251 246 256 257 250 244 252 267 261 258 268 252 246 258 271 272 256 258 259 258 269 268 266 256 261 269 271 257 270 260 261 286 276 274 259 277 275 265 259 256
5932 256 276 276 283 281 263 270 276 269 279 270 282 282 293 286 286 281 296 290 284 286 275 285 289 293 304 309 318 322 313 292 303 294 301 325 321 293 288 307 280 284 296 290 289 303 209 257 335 330 325 331
5882 331 342 351 335 336 340 357 355 332 335 339 350 355 359 329 313 316 329 338 343 361 384 425 364 293 308 325 327 347 340 397 267 310 330 339 349 375 452 250 298 306 317 343
5840 343 290 314 321 352 350 364 368 432 339 227 274 296 306 307 311 326 331 325 296 305 319 321 341 350 320 342 334 331 331 335 336 327 339 344 345 344 337 341 359 354 358 359 378 367 371 373 382 390 389 380
5790 380 395 378 383 368 388 380 390 385 397 403 407 398 405 405 413 405 405 426 427 413 414 413 441 424 435 422 440 451 474 455 447 434 445 451 449 451 474 468 472 477 480 486 492 502 522 462 475 488
5742 D88J1O3j78O5K0J5nK0J8qTJ0K3JK1%J3K6P5j70J32k07J21p8N8J00j65J5J2K5J8K5JkJ8N
5706 E78kK6%mL1JQ7j77N3K4O3k28J03L2LJ7QJ8J9JNJ0PKNPJ1RJ2oK6J7MKJ5K2rj1K5k0L3JK3
5663 H43QJ8OK6K1jK4n0O3QK7L3J3L4J3j5N5lJ3K0M6L8M4M1oM5RO7N0P6Q4J11J30L40n50M79
5627 B160j390R04K74J51K94K19M06O24O77M187r545m79J469P68N25M41M17M63O58Q79N604
5606 I706j5565M629J431R60P24K196q319N204l092J340P40O14M71P05R05R67M399p836r710
5587 i531M800J421Q32M39L67L24K05K15M07p4j698P54K35J81J60J13K9M7N0M5P6K3M3O1M1M2
5561 c93L3L1J3M7l1K1N9L5L4J7L0j4M1K4L7M5J8J9L2M2Qm3M4K5Q2j0n9J9O2P4RK8l3Q5K1PP0
5524 E29N1l9N3O8O0J3N7J8R4J05K03l47J00J31J11R2J14J35J88K14L26L33k111P45J99M34
$$ plain form
5742 488 499 562 384 449 469 484 479 499 517 509 501 511 534 535 556 556 569 595 670 500 632 425 546 468 526 626 461 476 488 513 531 556 557 555 573 578
5706 578 576 602 602 598 629 630 717 540 593 617 680 452 555 587 590 607 615 633 652 653 658 668 675 677 682 689 700 709 721 715 741 758 762 764 779 801 792 781 806 786 819 820 843
5663 843 851 869 875 901 922 921 945 895 958 966 993 1026 1039 1073 1086 1071 1126 1123 1136 1156 1202 1240 1284 1325 1319 1364 1373 1440 1490 1566 1650 1761 1891 2231 1681 2160
5627 2160 770 1674 1948 2099 2393 2612 3018 3642 4319 8506 -1039 -1518 -49 719 1244 1685 2102 2565 3223 4102 9706
5606 9706 -5859 -1230 201 1161 1885 4081 -4238 966 -2126 -786 -46 568 1039 1744 2649 3616 8015 179 -9531
5587 -9531 -4731 -3310 -2478 -2039 -1672 -1348 -1143 -928 -521 -595 -2293 -1539 -1304 -1123 -963 -850 -821 -774 -724 -679 -603 -580 -537 -476 -435 -393
5561 -393 -360 -329 -316 -269 -300 -279 -220 -185 -151 -134 -104 -118 -77 -53 -16 29 47 66 98 140 148 105 149 174 256 246 187 206 268 342 351 379 346 431 452 459 529
5524 529 580 541 594 662 722 735 792 810 904 1009 1212 865 965 1096 1207 1299 1413 1548 1736 1950 2276 2609 498 1243 1442 1876
5498 A876K77L81N55N37O40R57L210r381k765K383R33R43P30Q44O11R85M990j1272k202K156
5478 b612J698J321J384J748R493k4203O053J547Q85O86Q01P98P61R93M389n986p844L021
5460 e067J122M60M78K69K79J76L45q40M11P15r34L21J37J29R5M5M4Q8Oj7N9P0N5oM9N4K1J6o
5431 a426K9jM5K4M1J9L2m2L6K6K4J7KK2L8J4J2rj6L1J3L2qJ1K9K1KJ4J2JPK1K2KJ5J3%QkK1O
5390 h42J3TJ7oK4JnJK4KK1j3K1K6j8kL1J2NJ7K8n7m6L6K2J0rJ9K4L9n0L1l1M0Q0j05o2M1K0
5351 f28J2RM0L6j08K5K8J4QRJ6rm6K8jKpK2J1pK2k4LK8pJ2j%JTJ1Pk0K4KOJ2pPOj6J4L%J5nO
5304 d46jkJ0NT%J4qRj3nKK1MnMmPQokNJTKJ9lPnj1K2pQMOj1RlRJ4OQNL9j19L2J6K4P5j90N8M
5252 c78NK2MKQqJ4PTLJ5J0K4P6j88J48j95P6Q6j38M4l1LJ9J0LPlJ5mJ7lRj3J9QJ1M2r9K1kK5
$$ plain form
5498 1876 2153 2534 3089 3626 4266 5223 8433 -948 -3713 -1330 -397 546 1276 2120 2731 3716 8706 -2566 -4768 -2612
5478 -2612 -914 407 1791 3539 13032 -11171 -5118 -3571 -2686 -2000 -1199 -401 360 1353 5742 -244 -8088 -5067
5460 -5067 -3945 -3485 -3007 -2738 -2459 -2283 -1938 -2778 -2367 -1652 -2586 -2265 -2128 -1999 -1904 -1859 -1815 -1727 -1721 -1738 -1679 -1609 -1554 -1560 -1511 -1457 -1436 -1420 -1426
5431 -1426 -1397 -1398 -1353 -1329 -1288 -1269 -1237 -1279 -1243 -1217 -1193 -1176 -1174 -1152 -1114 -1100 -1088 -1097 -1113 -1082 -1069 -1037 -1045 -1034 -1005 -984 -982 -968 -956 -955 -948 -927 -905 -903 -888 -875 -875 -867 -869 -848 -842
5390 -842 -829 -816 -799 -805 -781 -780 -785 -784 -760 -758 -737 -750 -729 -703 -721 -723 -692 -680 -675 -658 -630 -687 -733 -697 -675 -665 -674 -655 -631 -592 -642 -611 -642 -602 -522 -627 -689 -648 -628
5351 -628 -616 -607 -567 -531 -639 -614 -586 -572 -564 -555 -539 -548 -594 -566 -567 -565 -572 -550 -539 -546 -524 -548 -545 -517 -524 -512 -513 -513 -512 -511 -500 -493 -513 -489 -487 -481 -469 -476 -469 -463 -479 -465 -462 -462 -447 -452 -446
5304 -446 -447 -449 -439 -434 -429 -429 -415 -423 -414 -427 -432 -430 -409 -405 -410 -406 -410 -403 -395 -401 -403 -398 -397 -396 -394 -375 -378 -371 -376 -387 -365 -372 -364 -360 -354 -365 -356 -359 -350 -336 -330 -322 -317 -278 -397 -365 -349 -325 -250 -440 -382 -378
5252 -378 -373 -351 -347 -345 -337 -345 -331 -324 -317 -314 -299 -289 -265 -189 -377 -229 -424 -348 -262 -400 -356 -387 -384 -365 -355 -352 -345 -348 -333 -337 -320 -323 -314 -327 -308 -300 -289 -247 -346 -325 -327 -302
5210 c02n3J1TPrJ4j0J0oK5JjNRpLj4kj1K2j3RMj5J9J2jMj8J8j1%LPlj0MJ0OjJ6j6OnQj0jJ7L
5161 b55Rp2L5RlJ2k%NJ0NrjJ3j4MJPNrpNOKj2MQnNlJmkOR%KrOKj0PmjONKj0J3%KJkJ%LNj1N
5102 b24J1kmk7J3J5j6J3m%mRlLTkJ1j2J1j4J3j3LNoJPL%oOMJ0j5qjJ3lTOTNnkQoJ1k1K7j7Po
5050 b00%jJ2kqKJ4j5QOj0LRrJ1j5MmKTJJ0k0mK1k1J0J6oPkj0JLjJj7OK4Jk0KkJ0kT%rJ7onQ
4998 a80j0NMJ4jnj2J0LKj3J5j3LONj1NLKmnmQMjMNj5J3pKNonKNnLnNqPTm%lJ3lRk4K4j1Jj9
4943 a80J1J4oJ3j8J1JqPJoPlKNLj7kJ4mNnJ4j3QPj2qOrQKJ4j5kKJ0qkK1j3j1J2Kk5J1J3J0l
4894 a36j0j1MJj%j6K8mNpjrpNM0oTj1j6J9j1plLJ7K4k1%OPj3Jkj1QJKOQj7j1J7jJj4J2J1KN
4844 a19j3Jj3MKrJ1QOJ3k3nj0J6j0nJ6kpJ7j7J0rKl%RJj3JJ6j4J6%oNj5J0LmjTRjlT%PQj9Qp
$$ plain form
5210 -302 -355 -344 -333 -326 -335 -321 -331 -321 -327 -302 -301 -302 -297 -288 -295 -292 -306 -308 -319 -297 -310 -301 -297 -312 -293 -281 -282 -278 -296 -278 -289 -289 -286 -279 -282 -292 -288 -278 -272 -273 -257 -273 -267 -272 -264 -274 -275 -258 -255
5161 -255 -246 -318 -283 -274 -277 -265 -267 -267 -262 -252 -247 -256 -257 -244 -258 -254 -253 -246 -241 -250 -257 -252 -246 -244 -256 -252 -244 -249 -244 -247 -246 -250 -252 -246 -237 -237 -235 -244 -238 -236 -246 -239 -243 -244 -238 -233 -231 -241 -228 -228 -226 -225 -227 -226 -226 -223 -218 -229 -224
5102 -224 -213 -215 -219 -246 -233 -218 -234 -221 -225 -225 -229 -220 -223 -220 -217 -219 -208 -220 -209 -223 -210 -223 -220 -215 -221 -220 -213 -210 -210 -216 -210 -206 -196 -211 -219 -220 -207 -210 -213 -207 -201 -196 -201 -203 -195 -201 -190 -211 -184 -201 -194 -200
5050 -200 -200 -201 -189 -191 -199 -197 -183 -198 -190 -184 -194 -191 -182 -191 -180 -195 -191 -195 -193 -191 -190 -180 -200 -204 -183 -204 -194 -178 -184 -177 -179 -189 -188 -185 -186 -185 -202 -196 -172 -171 -191 -189 -191 -181 -183 -185 -185 -194 -177 -183 -188 -180
4998 -180 -190 -185 -181 -167 -168 -173 -185 -175 -172 -170 -183 -168 -181 -178 -172 -167 -178 -173 -170 -168 -172 -177 -181 -173 -169 -170 -166 -161 -176 -163 -170 -168 -163 -169 -174 -172 -167 -172 -169 -174 -169 -177 -170 -163 -167 -167 -170 -157 -160 -151 -175 -151 -162 -161 -180
4943 -180 -169 -155 -161 -148 -166 -155 -154 -162 -155 -154 -160 -153 -156 -154 -149 -146 -163 -165 -151 -155 -150 -155 -141 -154 -146 -139 -151 -159 -153 -162 -154 -152 -138 -153 -155 -153 -143 -151 -153 -132 -145 -156 -144 -142 -167 -156 -143 -133 -136
4894 -136 -146 -157 -153 -152 -153 -153 -169 -141 -145 -140 -147 -148 -157 -164 -159 -119 -125 -131 -142 -158 -139 -150 -157 -160 -157 -140 -116 -137 -137 -131 -124 -137 -136 -138 -149 -141 -140 -138 -132 -124 -141 -152 -135 -136 -135 -149 -137 -126 -124 -119
4844 -119 -132 -131 -144 -140 -138 -147 -136 -128 -122 -109 -132 -137 -147 -131 -141 -146 -130 -132 -139 -122 -139 -129 -138 -136 -139 -139 -130 -129 -142 -141 -125 -139 -123 -123 -129 -124 -139 -129 -126 -130 -131 -132 -123 -124 -127 -130 -130 -123 -115 -134 -126 -133
4792 a33LONlJ0k0J7j5NpQlJ6qlJ1j0K%j1OJ5JqnJK%lTLkJ0oRj3jTJ3kKnLNjm%j0lK0j8J1J0
4739 a04j0Pj0MLj0KNLKLpJ1j5J4k0K%J8ljJpKpqjJ4JQj6JOklTjJ2K%oJ1j6JPMo%JUoJ3j3Op
4683 a16J1NpRjj3J2nkNkqRKNJj2J2j4KkOkL0k7kNj5J7JqJ2npqK2nRj6mnOPnmJ7k2OMLlJmNj0
4628 a10K1j9mQJ1j7J6j1LPrNOj2RqLPNnkOpRloJ0Lj5j2J0jKJ2pLj2J8j8Rkj3J1lQJlpkRLnkT
4574 a02RpnTmJ6nJ6nl%mOLk%Mj1pPOjTJ9Lrj0J1j0Lj3Nj1lK8Rk2J2lLj3K3jj8j3J3kKoj2RL
4522 i8M1k2lOj0pKJ4k3K4j6%J8j5lJ1LkrlL%KpJ4pj0K8j1Kk1K2j5J1jqLJmOpNjJJ2j3J4prJ2
4472 g7j2KRNrlQJ3k7J6j5OQpJNj8J1qJ4qKjJ1J3k2nOMmlj3PJRJN%mJnmTJ4jN%J0kok0KK2j8
4418 h5J6pj8J0J5Ok2K7kj6NLnrJ0l%Rk5J8j5LQLJ7j4Nj4Lrj0MKK3j0qJ5Mj3j1mK4rjQrjOMj1
$$ plain form
4792 -133 -130 -124 -119 -122 -112 -132 -115 -130 -125 -132 -124 -127 -111 -119 -122 -111 -121 -119 -119 -130 -124 -109 -108 -116 -121 -120 -118 -118 -121 -124 -121 -123 -113 -119 -110 -123 -124 -125 -112 -114 -112 -117 -114 -109 -110 -114 -114 -124 -127 -107 -125 -114 -104
4739 -104 -114 -107 -117 -113 -110 -120 -118 -113 -110 -108 -105 -112 -101 -116 -102 -122 -120 -120 -102 -105 -106 -105 -112 -110 -117 -125 -126 -112 -111 -103 -119 -118 -112 -114 -117 -120 -121 -109 -107 -107 -113 -102 -118 -117 -110 -106 -112 -112 -111 -110 -109 -115 -102 -115 -109 -116
4683 -116 -105 -100 -107 -98 -99 -112 -100 -105 -107 -102 -104 -112 -103 -101 -96 -95 -107 -95 -109 -107 -109 -103 -105 -75 -102 -104 -99 -114 -97 -96 -104 -92 -97 -104 -112 -90 -95 -86 -102 -106 -111 -105 -98 -103 -107 -90 -112 -106 -102 -99 -102 -101 -105 -100 -110
4628 -110 -89 -108 -112 -104 -93 -110 -94 -105 -102 -95 -104 -99 -93 -105 -96 -104 -101 -94 -89 -94 -96 -90 -97 -88 -91 -97 -87 -84 -99 -111 -101 -102 -100 -88 -95 -92 -104 -86 -104 -95 -97 -110 -99 -102 -94 -93 -96 -103 -105 -96 -93 -98 -100 -102
4574 -102 -93 -100 -105 -110 -114 -98 -103 -87 -92 -95 -95 -99 -93 -90 -92 -92 -88 -99 -106 -99 -93 -94 -95 -76 -73 -82 -92 -81 -91 -88 -101 -96 -107 -110 -82 -73 -95 -83 -86 -83 -96 -73 -74 -92 -105 -92 -94 -92 -98 -110 -101 -98
4522 -98 -57 -79 -82 -76 -86 -93 -91 -77 -100 -76 -92 -92 -74 -89 -92 -81 -78 -80 -89 -92 -89 -89 -87 -94 -80 -87 -97 -69 -80 -78 -99 -77 -92 -81 -82 -90 -87 -86 -90 -84 -91 -86 -87 -86 -74 -87 -73 -80 -89 -77
4472 -77 -89 -87 -78 -73 -82 -85 -77 -64 -91 -75 -90 -84 -76 -83 -82 -77 -95 -84 -92 -78 -86 -84 -85 -74 -61 -83 -88 -82 -78 -82 -85 -98 -91 -90 -81 -80 -75 -75 -79 -78 -83 -87 -91 -77 -78 -73 -73 -63 -65 -71 -91 -89 -67 -85
4418 -85 -69 -76 -94 -84 -69 -63 -85 -58 -60 -76 -71 -68 -73 -82 -72 -75 -75 -66 -91 -73 -88 -85 -77 -74 -57 -71 -66 -80 -77 -86 -96 -92 -90 -67 -77 -85 -70 -66 -79 -90 -94 -70 -79 -80 -72 -81 -82 -76 -72 -83
4368 h3K0k5qL2J3k9J0LJrkJ2rPlnK4nmk2QLJ8k0K2k0%K0Kj2j3KU%roJ1Oj4J3j0OJpj1K7j1qQ
4318 g2rK2mnmLjNonOlJ2k0K6j0K%Lkj9OJ0mjm%RJ3j1Kj6K2kLj5Pj8oM5j8JTmj4J3j0M6n0L5
4268 d1j9Ojj2J4J3k0qL1n5M7k2jOUN7q7O4n3KPk1J5K6k5rlL7j9oQRJ8k7rJ2j3QJ0j5K2k4K7
4224 c9l3K1njJ7j8m3N0Nl3QJ6J1k4J1j5NroK9o%Rj3KK4k7j5L2l1J7K9k4J3kj4qJ7LK1nj8J3p
4180 d3j3kqlL7j8j3K7n6L4QnJ0Ok6J9J1j5qjLK2qj5K1JNj8j7JPJ3mk7M9kMk7jLlJ0rj1M3k6
4134 d5j6K6j5jk1qN8Q1j54J08n3j5lLoN9k7kJ7n7K6j2M6m6L9l6J7l1j4J4L4m7P3r2N1LN3m4
4096 c7j56J72nl4P2k6Ol6Pj3l9M3L1o6L2l3mM6rK1l5JJ8k2j3L8j4J5jLJnk2oJ9p%J8KTpk1j0
4053 g4J2pK6J2k9OJ7m6L0Qj2o%j9N1l3K2l2oL8QMk3K2k3pJ7jk3RK4j4J2j5j1nL6Jjj5J4Jj8J
$$ plain form
4368 -83 -63 -88 -96 -64 -51 -80 -70 -67 -66 -75 -77 -65 -74 -67 -70 -75 -51 -56 -60 -82 -74 -71 -53 -73 -51 -71 -71 -51 -49 -61 -74 -72 -70 -68 -68 -77 -83 -72 -66 -80 -67 -77 -71 -70 -77 -88 -61 -72 -80 -72
4318 -72 -81 -59 -63 -68 -72 -69 -70 -65 -71 -76 -70 -73 -61 -81 -55 -65 -63 -63 -60 -62 -81 -75 -65 -69 -70 -74 -74 -65 -52 -63 -61 -77 -55 -57 -54 -69 -62 -80 -86 -41 -59 -58 -57 -61 -75 -62 -72 -26 -76 -41
4268 -41 -60 -54 -55 -67 -53 -40 -60 -68 -37 -92 -45 -67 -68 -62 -56 -50 7 -80 -16 -69 -67 -60 -81 -66 -40 -65 -74 -77 -40 -59 -65 -57 -48 -30 -57 -66 -54 -67 -59 -49 -64 -42 -66 -39
4224 -39 -72 -51 -56 -57 -40 -58 -101 -51 -46 -79 -71 -55 -44 -68 -57 -72 -67 -76 -82 -53 -59 -59 -50 -63 -61 -37 -64 -79 -47 -78 -61 -32 -56 -43 -45 -59 -67 -50 -47 -26 -31 -49 -36 -43
4180 -43 -56 -58 -66 -69 -32 -50 -63 -36 -92 -58 -50 -55 -45 -39 -65 -46 -35 -50 -58 -59 -56 -34 -42 -57 -36 -35 -30 -48 -65 -64 -57 -44 -48 -75 -26 -28 -24 -51 -52 -49 -52 -42 -51 -62 -19 -45
4134 -45 -61 -35 -50 -51 -72 -80 -22 59 -95 13 -40 -55 -58 -55 -61 -2 -29 -31 -14 -71 -45 -57 -11 -57 -18 -54 -37 -68 -82 -68 -34 -81 -8 -100 -49 -46 7 -37
4096 -37 -193 -21 -26 -60 12 -14 -8 -44 -37 -50 -89 -46 -15 -81 -49 -82 -86 -40 -49 -28 -63 -62 -44 -66 -79 -41 -55 -40 -41 -38 -37 -42 -64 -70 -51 -58 -58 -40 -38 -36 -43 -64 -74
4053 -74 -62 -69 -43 -31 -60 -54 -37 -83 -53 -45 -57 -63 -63 -82 -31 -64 -42 -74 -80 -42 -34 -30 -53 -31 -54 -61 -44 -45 -68 -59 -35 -49 -37 -52 -63 -68 -32 -31 -32 -47 -33 -32 -50 -49
4009 d9j6L7k6qN9n9J1M1k7NPk3qmJ1J9k4OQj3K1k1J5j2j6OL2m0M1l2J2kJ9Mj9nLNk2M3k6oj3
3966 f6PJ7lMk%j2LJ8m4K3j3J9jKJ2j1J6%j8POj2J7k5K0mlnJJ4lT%oj2K5k5L3Pj1pj8PTj5%J8
3918 c6k0nL0q%qQo%J1j4J6%j2%Rj4NJ3kj7mK6j4lnOnJ8j3QjTLJjTokN%Lj5pOj1L0Lj2JkNmN
3864 c7J6kpNJj6j0K8j8KlqK3k1JoPJ6Pj0Oj1J1qj2NJ4k4J0j5K1qnJ8kNk6RKpoJ7Jj0nRJ2j9
3816 e0J7NkqpKJ3KPpL%Pqk6QLJ0j0J0rR%oKkOj4PMLj4k0K3PQLk1J0MrJ7k7QkJ3%J3j9kLJ3qM
3762 b7qnK0k3J3kj0NLQm%oTJ2j7K0j0nJ4pjJ0Jj4kK8l0J1NknPj3MNj6J8qmRJ0pJ4k2J4ljoP
3712 b6j0QmrJ4LJk0LjJ9kj1MqTJ4onNK2j7K3onj3J7j0%LO%j5K0j7rM0l3pK4j8j1J6PQl2K2k
3664 b6k1K7k3Oj4N0Ol6k4jmK8MmJl8O1ll0J1Kj1NJ6j1Nl0OjK3%Lq%L1l9OLoJ3qj0J4jj8RTOT
$$ plain form
4009 -49 -65 -28 -54 -62 -3 -62 -51 -10 -37 -32 -25 -48 -56 -60 -49 -30 -54 -48 -40 -53 -32 -53 -38 -50 -66 -60 -28 -68 -27 -59 -47 -49 -30 -26 -45 -50 -47 -42 -64 -21 -47 -53 -66
3966 -66 -59 -42 -45 -41 -43 -43 -55 -52 -34 -78 -55 -68 -49 -50 -48 -36 -47 -31 -31 -49 -42 -36 -48 -31 -56 -36 -40 -43 -48 -47 -33 -36 -39 -39 -45 -57 -32 -57 -24 -17 -28 -35 -53 -46 -39 -54 -54 -36
3918 -36 -56 -61 -31 -39 -39 -47 -39 -45 -45 -34 -48 -32 -32 -44 -44 -35 -49 -44 -31 -33 -50 -54 -28 -42 -45 -50 -44 -49 -31 -44 -36 -37 -38 -35 -34 -35 -36 -42 -44 -39 -39 -36 -51 -58 -52 -63 -33 -30 -42 -41 -43 -38 -42 -37
3864 -37 -21 -23 -30 -25 -24 -40 -50 -22 -40 -38 -41 -49 -26 -47 -46 -52 -45 -29 -22 -32 -26 -37 -26 -34 -46 -41 -27 -51 -41 -56 -35 -43 -48 -30 -32 -27 -53 -44 -42 -49 -55 -38 -37 -47 -52 -43 -31 -50
3816 -50 -33 -28 -30 -38 -45 -43 -30 -28 -21 -28 -25 -25 -18 -26 -52 -44 -41 -31 -41 -31 -40 -31 -31 -37 -35 -37 -31 -45 -38 -34 -31 -45 -65 -42 -35 -27 -24 -45 -35 -31 -40 -23 -50 -42 -44 -31 -31 -18 -37 -39 -36 -23 -31 -27
3762 -27 -35 -40 -20 -43 -30 -32 -42 -37 -34 -26 -30 -30 -36 -42 -30 -47 -27 -37 -42 -28 -35 -36 -26 -25 -39 -41 -13 -43 -32 -27 -29 -34 -27 -40 -36 -31 -47 -29 -37 -41 -32 -22 -29 -15 -37 -23 -26 -27 -33 -26
3712 -26 -36 -28 -32 -41 -27 -24 -23 -43 -40 -41 -22 -24 -35 -31 -39 -47 -33 -39 -44 -39 -17 -34 -11 -17 -22 -35 -18 -28 -28 -25 -19 -19 -34 -14 -31 -40 0 -33 -40 -16 -34 -45 -29 -22 -14 -46 -24 -26
3664 -26 -47 -20 -43 -37 -51 -1 5 -31 -55 -56 -60 -32 -28 -32 -31 -69 -8 -11 -41 -30 -28 -39 -34 -18 -29 -24 -54 -48 -49 -26 -26 -23 -31 -31 0 -39 -33 -30 -36 -23 -31 -41 -27 -28 -46 -37 -28 -22 -16
3615 a6Lj0j9NJJ5onjRmMrM%TjnJ4j3RLj3J0ojrnLJ6J3rQn%j0j1oL1jmPqrPKnl1J2J9K2k8kj9
3561 e4O8k9l0J3j0QLm0L1j9M0N5o0l1NmNL2Q1j06mj1J8KpK2qJ07k26oK41m2k4k6j3K7l9K7l3
3522 c7J08l7o9mJ7j6kQ8k1p3%rL0Rj0j2QJ1L1k0k3mK3jj9j3J5J7rJMj0J2pLmj3K3j1OnJ2nNn
3477 a6pnJ0pj1J1TpqLJ0pkJOJkJ3j5lJ1oKTj7MJ4j8J9lKj8kJ7noJOJ1nJ0k1K7j9n%Njkpj6L6
3425 hJ6q%j4Jnk7K3M0m6pJ7j8K1j9Nj6K1M6J3o5lnK9l5K2K7l7J7%ljMKrQJ9k6lJj3J8LrJ1Pm
3378 a0j2JJ3MlRk9JQJ5jl7J5NPJ6Oj7j2J2j2RKj0KOJLj5qK1%MjJ0k6J6JjolkJ1j3oJ2pK1%rl
3327 a2JmOpmNlOJ0j8NLj0J1LMj4J0r%NJ1j0jpLRnoTLJ5Ljj0lrPJ4kOj7kK0jll0JK4RrQoj2j4
3272 c3L2Kj4j6J8QlJ7l0m2N1m0N0mnQj9jJ3l4M8o6O0nj1Qk9P5l6k1L1m3J5mPklo8J17o6K1O
$$ plain form
3615 -16 -13 -23 -42 -37 -36 -21 -27 -32 -33 -24 -28 -24 -33 -29 -29 -29 -30 -35 -21 -34 -25 -22 -35 -25 -31 -32 -41 -46 -43 -27 -14 -23 -15 -20 -20 -30 -41 -47 -16 -17 -21 -14 -22 -31 -24 -22 -27 -58 -46 -27 -5 -33 -35 -54
3561 -54 14 -15 -45 -32 -42 -34 -31 -71 -40 -59 -19 36 -24 -55 -50 -54 -49 -17 64 -42 -46 -57 -39 -37 -44 -22 -30 77 -149 -155 86 44 20 -6 -19 8 -31 -4 -37
3522 -37 71 34 -35 -39 -22 -38 -40 48 27 -46 -46 -55 -25 -16 -26 -38 -30 -19 12 -8 -31 -35 -12 -13 -32 -45 -30 -13 -22 -21 -17 -27 -15 -22 -19 -23 -36 -13 -24 -18 -23 -11 -16 -11 -16
3477 -16 -23 -28 -18 -25 -36 -25 -14 -21 -29 -26 -16 -23 -25 -24 -18 -17 -19 -6 -21 -24 -13 -19 -17 -15 -32 -28 -14 -32 -13 -16 -14 -32 -34 -17 -22 -28 -27 -21 -10 -15 -5 -26 1 -18 -23 -23 -18 -19 -21 -28 -44 -8
3425 -8 8 0 0 -14 -13 -18 -45 -22 18 -28 -35 -18 -36 -15 -34 -29 -45 -24 22 35 -30 -33 -38 -9 -44 -22 5 -32 -15 -15 -18 -19 -15 -13 -22 -14 5 -21 -24 -23 -36 -18 -15 -24 -13 -6 -10
3378 -10 -22 -21 -8 -4 -7 2 -27 -26 -18 -3 -4 -41 -26 -21 -14 2 8 -9 -21 -9 -21 -12 -10 -20 -18 -12 -11 -8 -23 -31 -10 -10 -6 -7 3 -23 -7 -6 -7 -13 -16 -18 -7 -20 -26 -14 -21 0 0 -9 -12
3327 -12 -11 -15 -9 -16 -20 -15 -18 -12 -2 -20 -15 -12 -22 -11 -8 -4 -18 -8 -17 -17 -12 -1 -11 -12 -19 -16 -7 -12 -18 -24 -21 -6 -3 -4 -14 -17 -26 -19 -5 -7 -1 -18 -20 0 -1 -4 -34 -33 -9 0 -9 -1 -7 -19 -33
3272 -33 -1 1 -13 -29 -11 -3 -6 11 -19 -61 -10 -50 0 -4 -9 -1 -20 -21 -8 -42 6 -60 0 -5 -16 -8 -37 38 2 -19 12 -31 -16 -20 -13 -15 -18 -86 31 -35 -14 -8
3230 hJ1Qk8MJ0J5l5j2O8l4j0J3J1k5pJ1MJk2J0J1oJ%loJ3jj2kJ0Rk3J7j3Qj6J4OJkTJ1j2nkj
3183 b0QNjj4J3kTKTJj1J0MrJ5k1K1jj8J3pjLJL%J4k0K3l3K3LKj0JOn1M9j1koj6K0lk2l8R9R
3135 C1j55J19j3J3Mk8j3mJ3m8J48j06M7k3kp8J40j21Q8l5K1rK2j3Ol4l3J68j90R5j3OJ9j9j8
3100 a5K2J4j1m0L3nQJRj7k7M7j3oJj1J2jTNj1OKJLj6R%jQmKLomjK%JLrPKJoMoNj%JMpKJ%j1
3043 a1J3Kj0MpPMjToJJ6JnpRrJ4%pJ3j6lJ9mj4oQKMK0j7TrJ8J3k2RJ5k2LJ5pj3k%K9k2J7j1
2993 Gj8jL5k5J1rjTOPj5mJ1J8k0KJ0Kk0NJ2pQKmj1%Nj9J1QToMj1LojMKLlMJ2j4QJk1J4lLmp
2940 eJ3olJ5njMj3%OLj1Nj%jJ0pQj1J0j0lQL%kQokMkpkJ5Pk3J4%oJ2j5MLmOplkLKjmKqOJJ3
2882 A4j2Rj0QOlj0MOJoQjj1RlOmq%kJ3q%oRLNJ%okJOn%lLKQqKMLrmomoK0LnrJ4nljMkqRqQqR
$$ plain form
3230 -8 3 11 -17 -13 -3 12 -23 -35 33 -1 -11 2 13 -12 -19 -8 -4 -3 -25 -15 -4 -10 -9 -9 -12 -18 -5 -6 -18 -20 -10 -1 -24 -7 -20 -12 -28 -14 -8 -7 -9 -11 0 -12 -17 -19 -20
3183 -20 -12 -7 -8 -22 -9 -11 -13 -11 -9 -8 -19 -9 -5 -14 1 -20 1 0 -18 -5 -12 -13 -10 -9 -6 -6 8 -12 11 -22 1 4 6 -4 -3 3 -48 1 -10 -12 -18 -34 -14 -17 -39 -77 22 31
3135 31 -124 -5 -18 -5 -1 -29 -42 -46 -33 -81 67 -39 8 -15 -17 -95 45 -76 12 -23 -2 -11 11 -2 4 -30 -63 105 -85 10 -3 3 22 3 -15
3100 -15 7 21 10 -30 3 -2 6 7 16 -1 -28 19 6 0 1 -10 2 1 0 5 -6 0 2 3 6 -10 -1 -1 -2 6 2 4 7 1 -3 -4 -2 -2 -1 2 -7 0 2 3 -3 1 -5 0 -1 -1 0 4 -3 -1 0 0 -11
3043 -11 2 4 -6 -2 -9 -2 2 1 0 -6 -5 11 12 7 0 9 0 14 14 7 20 4 1 20 16 2 -4 4 6 10 30 13 -4 -13 5 18 -4 5 20 -2 1 16 9 -4 -6 -6 23 1 18 7
2993 7 -11 -12 23 -2 9 0 -1 -2 4 11 -4 -8 3 21 1 3 13 15 -5 0 12 5 13 15 11 0 0 5 -14 -3 5 13 7 11 0 3 -3 -4 0 2 5 2 6 18 4 12 13 -8 6 3 6 2 -5
2940 -5 8 2 -1 14 9 8 12 -1 -1 5 8 -3 2 1 1 0 10 3 11 0 10 0 -3 5 8 8 6 14 8 6 10 8 1 -1 14 21 -2 12 12 6 18 3 7 10 6 12 5 2 0 3 5 4 0 2 -6 0 1 14
2882 14 2 11 1 9 15 12 2 6 12 13 7 15 14 3 12 9 15 11 3 3 1 14 6 6 0 9 12 17 18 18 12 10 11 17 12 12 9 12 14 22 14 16 20 23 14 10 4 0 -6 14 17 12 3 17 12 9 8 12 10 2 11 3 11 3 12
2817 A2kTloLJ3jlQKLrj1J0moK0nTmMRj4%JlJ6lTLlNpK%ljQJTpoPmJ1mjnKJ0j2J2j6LPoQj4RK
2757 A9TmqJjPLKj7J6jkNnTQj0J1j2J1j0J0lJ0j5oJ2j5JK1nlKJ1j9J3m%lk1J8RoOQlk1J4nJ3p
2706 B2MmJloMnJ8Mj2%rMkPKjk4L8k1nJ3kOTk5LJ5pTOMmqPJ2j2QkJ1j0n%oJ4lnK3m1L0mj%J8
2652 D6l1OJ2%mkJrJ3j1J9k3nK7Kj8J2j1%NpJ9j7oK4j4lOl%J0rmnOJ3olpPmjlJ%pK8k1mlJ5kl
2599 B6LJ1okTMQlqQqlNjOlJ0j6mMjMJ0j2j0J0mj5J5PJ6j3nlLkJ7Kk5oJ2kQj2L5l1LJ6moJTK
2546 D0j3K8j5k4K3Qj3JKNmkJ1nj5J4J5qMjol4M8nrkNj1QKJl3QL0Pk2lK1k2MJ9Jj8OLkJ0kj1k
2496 D2TJ1%lMRjrRoTMlJ1%nJ6j5Lj3J1jqOKOrORj6J7oj3QMpPqJ6koLlnRnmJ9poPlJOKrmJ4m
2437 G3J7k3J0Qj2J3nOJ2j8MQkPkJNMj3jJ2jJ2RJj1J2lJ4LNTMK2J9j1L7J3MO1J01l32P7O1N7
$$ plain form
2817 12 10 8 5 -1 2 15 14 11 19 21 24 15 4 14 10 4 24 19 14 10 14 23 9 9 10 7 23 20 17 20 17 22 15 17 17 14 13 21 22 23 16 10 17 13 24 20 19 14 16 26 14 26 10 13 20 14 22 8 17 19
2757 19 19 15 7 8 7 14 17 19 2 18 17 15 20 15 10 18 8 19 7 18 8 18 15 25 10 4 16 1 2 23 18 15 17 28 9 22 18 18 15 -6 12 21 15 21 29 26 5 19 14 27 20
2706 22 26 22 23 20 14 18 13 31 35 23 23 14 18 16 23 25 24 0 38 17 12 25 23 29 35 10 13 28 21 14 20 24 20 12 19 31 19 27 25 36 26 21 21 15 29 26 21 44 3 33 29 28 28 46
2652 46 15 21 33 33 29 27 28 19 32 21 40 17 12 39 41 23 35 24 24 29 22 41 24 18 42 28 25 31 28 28 38 29 25 20 26 39 33 30 23 30 26 25 22 23 23 16 44 23 19 16 31 29 26
2599 26 29 40 34 32 30 34 42 39 31 39 31 28 33 32 38 35 45 29 25 29 28 32 42 30 20 30 26 11 26 33 49 36 31 28 31 29 46 48 23 17 29 27 35 23 58 27 30 46 42 36 37 38 40
2546 40 27 55 40 16 39 47 34 35 37 42 38 36 47 42 27 41 56 48 52 51 45 11 59 54 45 43 48 37 45 47 48 15 23 53 60 38 35 56 34 38 57 58 40 46 49 47 57 55 44 42
2496 42 42 53 53 50 54 63 62 53 62 56 50 54 51 62 62 57 73 58 61 48 59 58 50 56 58 64 55 61 70 54 71 65 52 60 64 57 64 56 72 70 64 67 64 59 68 63 59 78 71 65 72 69 70 76 78 69 65 79 75
2437 73 90 67 77 85 73 86 81 87 99 81 85 93 91 98 96 97 102 106 93 92 104 103 115 124 125 114 126 123 137 140 145 150 154 176 195 184 221 234 238 299 400 68 145 206 263
2392 B63N9J83l24k44J40R4Q3J17K38r92J88J08J04O3J98m08j65J21N2N5N8O0l15Q0L9K6J0J3
2364 i6J7LOJ3j4J3oMJ6knK3j0QqMLrMPJ0j1LMJjMj0PmMJ0qJQj1K2j7J1OnqnRJJ5j0Oj4LoJ5
2312 Aj7J2J9j6jJJ3j2j5K9Kj8KTQj1J5j7PmJ0MqpPJjMLj2OJ4qJj4NlRqMPqJ6kj3J3j5jTlJ1M
2260 A5JOoplLJ3PpNplOlJj0nJ1J3nj0kMJ0mjknRpmOMmlJ3nOJ0j3rKP%MKj4kJ1J0j4Mj1J1RN
2204 D2j4JJ3njpLorM5l2nMoROnjj7J7K7l3PRmk3J9Pj5%LJlJ5mnj8K7J2k0lq%J3r%J0mMOj3J1
2152 D1qJ%Ojj0mKnPMJLl%qJJ3RnJjk3NJ9lj0J0lJ1j3J3rj6nK8%r%mnPK0k4QPoJ1j5NLj2LMLr
2096 C5J0NmjQj8NmMJ1mMq%TJ2qlkjRlkOTj5oK4j3oJ5j4QopK9k2JOknRMk3%K8k3MJ0j3NJ3%j9
2042 C9knJ7JPk6K2oqJ4nlQkJ2j8Jj0JJ6J2j1kMKqjOojJ4Rjj8jTKJNmTJ3nJkj6MKQopK1%Mj1J
$$ plain form
2392 263 322 505 181 -63 77 171 254 371 609 -383 -195 -87 17 80 278 -130 -295 -174 -122 -67 -9 51 -264 -184 -145 -119 -109 -96
2364 -96 -79 -76 -70 -57 -71 -58 -64 -60 -44 -46 -51 -28 -38 -30 -38 -34 -31 -40 -36 -29 -19 -30 -27 -23 -22 -23 -19 -29 -22 -26 -22 -12 -20 -19 -11 -22 0 -17 -6 0 -5 -13 -18 -9 -8 7 -3 3 -11 -8 -14 1
2312 1 -16 -4 15 -1 -2 -1 12 0 -15 14 16 -2 0 2 10 -1 14 -3 4 0 10 14 6 -1 6 7 6 10 13 1 7 21 13 14 0 5 2 11 3 7 14 6 22 20 7 20 5 4 3 0 11 15
2260 15 16 22 16 9 6 9 22 29 22 27 20 17 23 20 21 11 6 17 30 25 15 13 17 27 23 22 20 15 24 17 13 19 23 19 16 29 24 30 40 27 18 20 27 27 31 33 19 17 28 38 24 28 17 28 37 42
2204 42 28 29 42 37 36 29 32 26 17 62 30 25 29 23 32 38 33 32 15 32 59 26 33 42 38 15 34 41 26 26 29 30 27 42 38 33 15 42 54 34 31 23 23 36 27 27 37 33 37 43 30 41
2152 41 33 34 34 40 39 29 25 27 22 29 33 34 37 34 34 26 27 40 49 44 45 44 21 26 45 42 32 42 39 50 37 50 41 25 20 48 48 39 39 35 30 37 57 33 41 48 42 53 38 43 46 34 37 41 44 35
2096 35 45 50 46 45 53 35 40 36 40 51 47 51 43 43 43 55 47 44 42 41 50 47 45 51 57 42 36 60 47 41 56 42 50 44 37 66 44 45 51 49 44 53 57 34 34 62 39 43 53 40 45 58 58 39
2042 39 37 32 49 50 57 31 53 47 39 53 48 45 53 51 63 45 46 36 37 53 65 54 52 56 58 50 49 55 49 48 62 71 70 52 51 50 52 53 58 54 50 63 58 59 57 41 45 47 55 49 42 63 63 67 56 57
1986 E7qQNpQqPpLKpJ0jj4PTnmJnJ4lj1MTJqJ2J1j2RoTJRj3PjJ%Kj1QPKj1NKLlJ0j0nNPKMpj0
1927 F2TPKnJ3omKJ2j0LJ5j8j9K7qPj0J1mJlRk3J0J5qoL4Nm4qLJ2MJ0rjqL6J0o7L1J5j2MqJQr
1877 F9j2K1pKJ4mj4ROpJ0j9JNTKNrqRJ1j7%PmrOLTrJ4Roj1jRj1jJ7qJlRLqMj1JKQLQj3Qj0lK
1820 H1Mj9J0J6rLJmqJ5j1lRrK4Mj3Rk6J1Rj3J0p%QOrJ0j7K9j3j7J8Jj1J3J9k2k4NJ4J0r%KP
1773 A04J0N8r8k3N0Lj2J1j0pJ9J7Mk7J3jKoJ5lk3J3nMJ6j3jQ%j1Pj5l5P7n3K1JmONj6K5oqOr
1727 A09k0K2NJ1%k7J4nL%j3jJ1J3qLj0OJ1lj3%J7onMj0NkJ2kjKlKlJ5j3JklNj0J1Mk%LOMj2o
1675 A19J0nj2K1jMk5LJ3klrJ7LnomJ1jJ0j8MkJ1Pj3QnOj2RmPNkmJ2pJj4J4%k%Mj1PJ1j8LJ1o
1623 A40Nj3K0pj3MPQoj7J6JLj1J2JkJ2po%Kj1J2MKj6J1qRpK6j3jpPlOMQj9NkjJ0kJ0LNj0LrK
$$ plain form
1986 57 49 57 62 55 63 55 62 55 58 60 53 63 62 48 55 62 57 53 54 49 63 60 49 53 57 58 50 62 73 61 70 64 58 59 68 55 62 61 62 62 64 53 61 68 70 59 64 66 69 66 76 66 61 66 73 75 79 72 62
1927 62 62 69 71 66 79 73 69 71 83 73 76 91 73 54 81 73 80 70 81 77 78 75 84 61 71 86 78 72 106 111 67 59 62 74 78 88 79 78 70 106 116 49 80 95 83 87 79 80 88 79
1877 69 57 78 71 73 87 83 69 78 84 77 87 68 69 74 79 81 86 77 69 78 89 72 72 79 75 66 72 75 78 69 83 92 86 75 74 83 72 71 88 80 81 78 87 90 82 86 75 76 78 86 89 97 84 92 82 79 81
1820 81 85 66 76 92 83 86 87 83 75 90 79 76 85 76 100 104 91 100 74 85 94 81 91 84 84 92 98 89 99 82 111 98 81 99 100 89 102 121 99 75 80 94 104 95 95 97 104
1773 104 114 172 74 51 101 104 92 103 93 86 105 122 126 99 112 111 113 107 122 119 96 109 104 108 124 111 110 118 118 107 114 99 64 141 88 109 110 106 112 117 101 126 120 112 118 109
1727 109 89 111 116 127 127 100 114 109 112 112 99 98 109 122 114 117 107 113 124 121 108 108 125 119 114 118 108 113 111 123 121 120 122 119 121 118 133 120 121 119 116 121 111 122 126 124 124 127 133 137 125 119
1675 119 129 124 112 133 132 136 111 114 127 125 122 113 130 133 128 122 118 129 128 138 120 124 122 133 140 127 135 130 136 124 133 129 136 141 139 135 147 140 141 127 141 141 139 139 143 132 139 150 132 135 146 140
1623 140 145 132 152 145 132 136 143 151 145 128 144 145 148 137 149 150 148 160 153 147 147 149 138 150 154 156 140 151 143 152 145 171 158 157 150 157 154 160 164 172 153 158 156 155 165 163 173 176 181 171 174 165 167
1570 A67Jkj1MLj6J1NpMJ4j3njLTJ2j0J5JqmpKK1k1KOmOlNkRj2KRj2oJ6nJ3j4LOKj0J3lqmOJj
1516 A76J1qNkK0j1qJTJ5k4J5lKNJ0j3jj4K5lj2jOJ4oj0NjMjLmJ3rJ7lRmj0J1Lj8M%lQk0kJ9
1466 B11j0O%RnlmJ6lJ3ojJLKj0RKnJ1mNJ4rpMj3J3jOpKOkTnNPK2k3nRj2J1mJ5lj8K2m%knJ8p
1411 B62PLJM%nNlqJ2lOLjKj1J6j1rJ0J9pQr%O%ONTrQOjlJLQkTJ4olJ0oOJ1lTJ0LPJ1j1J5J1
1355 C88K3J6J8K9M0j07j51j2K8K5J7J2J8j8J0qKJ7J4MNkOj1K7knRKRQmJ3l5P9m4J1nQJ0J1k3
1313 D32qK6n6P8l2K2K3MJ1M0j32N9j3NK2j7L1L0k2QJ0K2m6L9j%Oj9qL5Mj5K8J2PJL7kMl2J0
1272 F03J1MJ5KJ6NK9pMK2j1J3jJ5QJ3J4K6lJ3J5QL7o5N9L0l7L2J2L2K1OQPM2RJ1RL2K2K4M3
1230 A148L1LQ3o0p5K8K7L6N5L2TL7J9L9L3L9M7N1N8P5L7N0R2QR1M8N5J09J07R8J04J42J55
$$ plain form
1570 167 168 166 155 159 162 146 157 162 155 159 173 160 155 154 157 160 172 162 177 178 170 166 159 161 182 161 163 169 165 171 168 173 171 180 168 170 179 167 161 177 172 185 171 174 180 182 172 185 182 174 170 176 177 176
1516 176 187 179 184 182 202 191 183 184 185 200 176 191 188 190 195 205 192 191 177 202 199 187 186 192 206 200 190 195 194 198 197 200 196 209 200 217 214 223 219 209 220 223 205 209 209 206 214 194 192 211
1466 211 201 207 207 216 211 208 204 220 217 230 224 223 224 227 229 219 228 230 225 236 232 237 251 242 235 239 226 239 238 244 237 239 245 243 241 236 241 248 270 247 242 251 239 250 246 261 258 240 262 258 258 256 251 269 262
1411 262 269 272 273 277 277 272 277 274 266 278 275 281 284 283 285 274 290 279 270 280 299 292 300 291 291 297 297 303 308 313 304 312 318 317 314 315 318 326 324 322 336 330 327 337 331 337 348 345 342 352 355 362 373 362 377 388
1355 388 411 427 445 474 514 407 256 244 272 297 314 326 344 326 336 328 330 347 361 365 370 368 374 363 390 388 383 392 394 403 411 407 420 385 464 420 431 426 434 444 455 432
1313 432 424 450 394 472 440 462 485 489 500 540 408 467 454 459 481 464 495 525 503 511 521 543 497 536 535 535 541 522 514 549 553 538 566 578 585 586 623 621 625 593 603
1272 603 614 618 633 635 651 656 685 678 682 704 693 706 705 720 728 741 755 781 778 791 806 814 851 786 845 875 838 870 882 914 935 941 949 956 998 1007 1018 1027 1059 1081 1105 1148
1230 1148 1179 1182 1265 1205 1130 1158 1185 1221 1276 1308 1340 1377 1396 1435 1468 1507 1554 1605 1663 1738 1775 1825 1917 1925 2016 2064 2119 2228 2335 2433 2537 2679 2834
1197 B834J58J13J71J74K28L19L21L93M71Q54j366J125J129J199J573K198L489M134P063
1178 B6580N3173j36707L1613R653L754K105J865J355P54J072K078k943Q37M60L42L29K99K10
1160 c171J60M5R1J23J06J21J06Q7R4Q4M4O8N2K3P0N0N3N4M5N1L4M4L0M3L1M0K3M8L7O3nKq6
1127 a340J2M6L4J8L3K2J3L3K6pL2K0J8MJ8K0J6J7K4QJ5QnRNJ7J5J3OJ0J5K1J1J2J1LJ8pJ1T
1087 g34J3J2J6J1J0KRj9mKJ3J8J2MK3PrK0K2j9nK1OK7l5Ok4M8j9J3L7k7L3J8j7O7q5n0M5J6
1047 e16j0L1k9P1l9J8Ooj0K0L%Pj5K1k3L0J0kJ1lLJ3KJk6M6KrR%OPjJ4kRJ6jJ2K8TN2j3j56
1002 c85r9J9L2J9J7Q%J2MnjPJ0M%LmjQTKJ6nT%K1j8jJJ0ojK1lj0jPmJ1J0nKNlTMj1NQM%J4j4
949 b93Ro%lJNJ1J2mj1LJ%KJ5Rj5kPJRmnJ8k3JK0JpRroM%kRjJ8%Kj4nL8j2m3K4MLKoNoK4nn2
$$ plain form
1197 2834 2992 3105 3276 3450 3678 3997 4318 4711 5182 6036 4670 5795 6924 8123 9696 11894 15383 19517 26580
1178 26580 79753 -56954 -25341 -15688 -11934 -9829 -7964 -6609 -5855 -4783 -2705 -5648 -4811 -4351 -4009 -3680 -3381 -3171
1160 -3171 -3011 -2966 -2875 -2752 -2646 -2525 -2419 -2332 -2238 -2154 -2110 -2042 -1990 -1967 -1897 -1847 -1794 -1740 -1695 -1644 -1610 -1566 -1536 -1493 -1462 -1422 -1399 -1351 -1314 -1251 -1256 -1254 -1340
1127 -1340 -1328 -1282 -1248 -1230 -1197 -1175 -1162 -1129 -1103 -1110 -1078 -1058 -1040 -1036 -1018 -998 -982 -965 -941 -933 -918 -910 -915 -906 -901 -884 -869 -856 -850 -840 -825 -804 -793 -781 -770 -767 -749 -756 -745 -734
1087 -734 -721 -709 -693 -682 -672 -670 -661 -680 -684 -682 -669 -651 -639 -635 -612 -605 -614 -594 -572 -591 -596 -575 -569 -542 -577 -571 -595 -547 -566 -553 -516 -543 -510 -492 -509 -442 -527 -577 -532 -516
1047 -516 -526 -495 -524 -453 -492 -474 -468 -474 -484 -464 -461 -461 -454 -469 -448 -471 -441 -431 -433 -422 -425 -422 -409 -407 -406 -432 -386 -384 -393 -384 -384 -378 -371 -372 -358 -360 -351 -335 -336 -324 -296 -268 -216 -229 -385
1002 -385 -484 -465 -433 -414 -397 -389 -389 -377 -373 -378 -379 -372 -362 -358 -358 -355 -359 -360 -352 -344 -342 -326 -331 -336 -336 -315 -333 -334 -333 -323 -329 -330 -309 -312 -322 -323 -316 -320 -309 -299 -304 -302 -297 -300 -303 -299 -310 -305 -297 -293 -293 -279 -293
949 -293 -284 -290 -290 -293 -292 -287 -276 -264 -268 -279 -276 -275 -275 -273 -258 -249 -264 -266 -259 -258 -249 -253 -258 -240 -263 -262 -242 -241 -248 -239 -248 -254 -250 -250 -252 -243 -244 -226 -226 -224 -238 -243 -205 -217 -260 -236 -232 -229 -227 -233 -228 -234 -210 -215 -267
894 b67L6RMPJl0L1j8lTPJ3%kl0N2Lk3J5lTJj0J6k1K3j2k0J3kJ2J3j5j3NJLJLJ1%TRjj3%J4j9
846 b05KOJ1PrJ3pJnlLqJ2oJ1krKJ1j0J0%jj0JRmKNJ2Knj0%MljNkJ1nj%KJ0%rl1OK0MQK0j1k9
791 a76kJ0noOKQ%j8J0O4j8l4K6oj2qk7RJ6RLjqJ8j1l0N0M4o7J0j1nMPoqTM2Mk1jRJ6j5rLOK1
742 a16m3kK7nMK0l3rJ3OpRmjJ0jrQKj4K1orjJ2L%j2MLPJ2j6jqKlMJ4j2J2lj2NOnj2JNJ4mLo
689 a27J5j9kNJKjKlLmJ4j1KQLTk2K4kj8K6mj4oJ5j1%TJ2oJ5pTroJ9k2K7%qrJ0J2j6j5QJ8pJ0
639 a02pj7j6K6J2j5PTKPnLk2rJ7OJJ6jnj3OLOQrk9J4J7l1K6rLJ0lj2pJ2k2K1N%j4QkLJ7j3Jl
589 a02NplNk8J2K5J4kj3kNj5PqoJ4MjqJ4Pj2j3RJ4j9K4j6J6j4nQLqJ2j1RJTjnMnJ4j6rKJ1T
539 g8j4moMloJ4kJ6j1K0jrj3j0MJ0Mj1pK0Mj0MKnPj6K2qpQ%j5J7Nk0QMqJ3jj1R%qJ0Kj0MqJ0
$$ plain form
894 -267 -231 -222 -218 -211 -210 -240 -209 -227 -230 -233 -226 -213 -213 -215 -245 -193 -190 -213 -198 -201 -204 -203 -213 -197 -218 -195 -207 -227 -214 -216 -204 -191 -206 -219 -214 -213 -210 -209 -206 -195 -195 -195 -186 -187 -200 -200 -186 -205
846 -205 -203 -197 -186 -179 -188 -175 -182 -181 -186 -189 -186 -194 -182 -188 -177 -179 -188 -186 -175 -185 -175 -175 -176 -186 -185 -176 -180 -178 -173 -161 -159 -164 -174 -174 -170 -173 -174 -169 -171 -160 -165 -166 -166 -164 -154 -154 -163 -194 -188 -168 -164 -156 -136 -147 -176
791 -176 -178 -168 -173 -179 -173 -171 -163 -163 -181 -171 -107 -125 -159 -133 -139 -151 -159 -186 -177 -161 -152 -149 -150 -158 -140 -151 -181 -131 -87 -154 -144 -155 -160 -156 -149 -155 -163 -171 -129 -125 -146 -147 -138 -122 -137 -146 -143 -137 -116
742 -116 -159 -161 -134 -139 -135 -115 -148 -157 -144 -138 -145 -136 -140 -141 -131 -132 -141 -133 -131 -145 -124 -130 -139 -140 -128 -125 -125 -137 -133 -130 -123 -111 -127 -128 -136 -134 -137 -133 -119 -131 -119 -122 -134 -129 -123 -128 -140 -139 -134 -120 -124 -121 -127
689 -127 -112 -131 -133 -128 -127 -125 -126 -124 -127 -124 -128 -114 -125 -123 -115 -112 -109 -131 -107 -109 -127 -101 -105 -119 -125 -110 -121 -121 -121 -109 -115 -100 -107 -114 -123 -129 -110 -132 -105 -105 -113 -122 -112 -100 -116 -131 -123 -105 -112 -102
639 -102 -109 -126 -142 -116 -104 -119 -112 -105 -103 -96 -101 -98 -120 -129 -112 -106 -105 -89 -90 -95 -108 -102 -99 -93 -85 -94 -123 -109 -92 -123 -97 -106 -103 -93 -96 -108 -115 -103 -125 -104 -99 -99 -113 -105 -107 -104 -87 -100 -99 -102
589 -102 -97 -104 -107 -102 -130 -118 -93 -79 -81 -94 -96 -91 -106 -99 -107 -113 -99 -95 -96 -104 -90 -83 -95 -108 -99 -85 -104 -80 -96 -80 -94 -99 -91 -88 -96 -84 -95 -86 -85 -84 -85 -90 -86 -91 -77 -93 -102 -100 -89 -78
539 -78 -92 -96 -102 -98 -101 -107 -93 -95 -79 -90 -70 -71 -80 -93 -103 -99 -89 -85 -96 -103 -83 -79 -89 -85 -83 -88 -81 -97 -75 -83 -90 -82 -82 -97 -80 -75 -95 -87 -83 -91 -78 -79 -90 -81 -81 -89 -79 -77 -87 -83 -91 -81
487 h1NkKqJ6j8Oj3Nj2J7lJ6k1NkJ3j1JLNJ5k6QJ3olqnKJ1J0mlKj2LKTjJ5nkNj3OqJ1jmpJ0Qr
433 g1J0j0JrJ4j3pJ1ONqKjk1QK0LqrlJ4k2MQLmNToTRMpoQKkNnpJNjOJKjk0J2kMqQqJ6jj8J9
375 f3j3J5j7J9j0jkTJ2qOlTJ4J1l5PmJ8qmQjLnJ2rpLlTKJ4J3k4lPqK0JKLoJk4J2j1LJ7njj0
323 g0J1pj%J1j1rmL3oJnpmQToklk0L0J4j9MLj5PpJ0rKJ5j6J4j1Mj7JK4j2RoPomOnOj3J1K5j9
271 e0jkMkMoMJj7J4k0J4MQj2QnqlJ0kKMk0J0J1NkLloLoJQop%kJ5J6j7oJTpJ6j4KpJ2Lj2oLq
215 g0J0K3j8Pj5J3j5J7J1j6LnJ5j6mnPJ7kj0J2pKpoK3l4J3L6j0j4j7J0kR%k1J4J1J8k0j1JO
171 d7l7N2J8k7qJ0k0K3j0mj1qM2Nj8lPj1j5J5Nj3RLOlQkj0MK2k6JRJj0J6k4K6j4J0ko%TJKnK
122 c7moJoJ1oKRLkKj2nJ4qLMmr%K0rpOmkJ7j7J3nj7J5NojJjJJ2j0nJOmOj2LNj6K2jlTK0l0J4
$$ plain form
487 -81 -76 -78 -76 -84 -68 -86 -80 -93 -88 -100 -83 -86 -70 -91 -86 -88 -75 -86 -85 -82 -77 -62 -88 -80 -67 -73 -76 -84 -89 -87 -76 -66 -70 -73 -71 -83 -80 -78 -76 -77 -62 -67 -69 -64 -77 -71 -79 -68 -69 -73 -80 -70 -62 -71
433 -71 -61 -71 -70 -79 -65 -78 -85 -74 -68 -63 -71 -69 -70 -91 -83 -63 -60 -68 -77 -80 -66 -88 -84 -76 -73 -77 -72 -67 -73 -79 -70 -66 -73 -79 -71 -69 -71 -66 -71 -78 -77 -72 -73 -67 -66 -64 -65 -85 -73 -75 -71 -79 -71 -79 -63 -64 -82 -63
375 -63 -76 -61 -78 -59 -69 -70 -72 -74 -62 -70 -64 -67 -70 -56 -45 -80 -73 -77 -59 -67 -71 -63 -64 -61 -66 -54 -63 -70 -67 -70 -73 -71 -57 -44 -68 -71 -64 -72 -52 -51 -49 -46 -52 -51 -75 -63 -74 -71 -54 -59 -60 -70
323 -70 -59 -66 -67 -67 -56 -67 -76 -80 -47 -53 -52 -57 -64 -68 -60 -52 -58 -60 -63 -83 -53 -39 -58 -54 -51 -66 -59 -66 -56 -65 -63 -48 -64 -50 -61 -57 -74 -73 -49 -61 -52 -58 -51 -57 -61 -55 -60 -54 -67 -56 -31 -50
271 -50 -51 -53 -49 -51 -47 -53 -49 -48 -65 -51 -71 -57 -53 -45 -57 -49 -54 -62 -65 -55 -57 -55 -51 -71 -61 -50 -45 -47 -44 -47 -53 -50 -56 -55 -47 -53 -60 -60 -62 -47 -31 -48 -54 -53 -52 -59 -43 -57 -55 -62 -50 -47 -59 -65 -62 -70
215 -70 -60 -37 -55 -48 -63 -50 -65 -48 -37 -53 -50 -55 -40 -56 -60 -65 -58 -41 -43 -53 -41 -48 -46 -53 -59 -36 -70 -57 -21 -31 -45 -62 -52 -54 -45 -45 -66 -52 -41 -23 -43 -54 -53 -47
171 -47 -84 -32 -14 -41 -49 -39 -59 -36 -46 -50 -61 -69 -27 -22 -40 -43 -36 -47 -62 -47 -42 -55 -46 -43 -37 -40 -32 -34 -44 -40 -18 -44 -43 -34 -33 -43 -27 -51 -25 -39 -29 -31 -37 -37 -37 -36 -34 -39 -37
122 -37 -41 -47 -46 -52 -41 -47 -45 -36 -33 -35 -33 -45 -50 -36 -44 -41 -37 -41 -50 -50 -30 -39 -46 -40 -44 -46 -29 -46 -33 -38 -55 -40 -35 -41 -42 -41 -42 -41 -29 -39 -44 -43 -37 -41 -35 -47 -44 -39 -55 -33 -34 -37 -40 -20 -50 -36
66 c6lnj2ML6rj6rJ8kj3J3j2OjLQPj7%mTJ7Jj0oOKMoPjnNonMRrKkPj0J1Qj6RKRj7J2q%MJjOmT
7 c2KpM%j0J5l
$$ plain form
66 -36 -39 -44 -56 -52 -16 -25 -41 -50 -32 -34 -47 -34 -46 -40 -41 -38 -30 -23 -40 -40 -44 -48 -31 -30 -40 -46 -40 -38 -34 -40 -33 -34 -39 -34 -40 -45 -41 -32 -41 -39 -41 -34 -44 -33 -25 -41 -32 -30 -21 -38 -26 -34 -34 -30 -29 -30 -24 -28 -32
7 -32 -30 -37 -33 -33 -43 -28 -31
0 c1
##END NTUPLES=NMR SPECTRUM
##END= 
