##TITLE= 1D WINNMR
##JCAMPDX= 5.0 $$ JDXCONVERT version 1.0a 08/10/2002 8:36:54 AM
##OWNER= guest
##ORIGIN= 1D WINNMR
$$ c:\temp\new\t.jdx
$$ created by JDXCONVERT 08/10/2002 8:46:29 AM
$$ original file c:\temp\t.jdx was  NMR SPECTRUM HZ
$$ all y-values are relative
$$ only 1 in 2 points were used
$$ integrals are approximations only (values less than 13.417 were ignored)
$$ the presence of integrals violates JCAMP-DX protocol. 
$$ this file may not be properly read. 
##DATA TYPE= NMR SPECTRUM
##.OBSERVE FREQUENCY= 200.13574758
##.OBSERVE NUCLEUS= ^1H
##.ACQUISITION MODE= SEQUENTIAL
##.AVERAGES= 32
##SPECTROMETER/DATA SYSTEM= A3000
$$ the following records were modified by JDXCONVERT:
##DATA CLASS= XYDATA
##XUNITS= HZ
##NPOINTS= 386
##FIRSTX=2022.93155946
##LASTX=1760.687060265
##DELTAX= -0.682040288121109
##MINX= 1743.1823614218 $$ (8.71 ppm)
##MAXX= 2027.3751229854 $$ (10.13 ppm)
##XFACTOR= 0.341020155
##YFACTOR= 7.45323097562793E-04
##FIRSTY= 7.45323097562793E-04
##MINY= 0
##MAXY= 10
##XYDATA= (X++(Y..Y))
5932AKK0poKj7K6k2J9j0lkoL5nKj0K3K%k1L8j43Q3LoK4JJ8lJM0l4j8J7J21j20
$$ 1 3 23 16 10 12 -5 21 -1 18 8 5 3 -3 32 27 29 19 42 44 44 23 61 -82 1 4 -2 22 23 41 38 39 79 45 27 44 165 45
5858.00000070573D5%QP1j01J1K3j4J1Q3j08OJ1J24j29k0J1NMmj8J3JLqK
$$ 45 45 53 124 23 34 57 43 54 137 29 35 46 170 41 21 32 37 41 37 19 32 33 36 28 30
5808.00000102652C0k3J3K%qRjlNK4k1j0J0j7J9j5QKlmqJ4mJ6jmj9J9JOL
$$ 30 7 20 22 22 14 23 22 19 24 48 27 17 27 10 29 14 22 24 21 17 9 23 19 35 34 30 11 30 31 37 40
5746.00000137939D0J41j18j8Mnj2Rj2RRJ9j4Q0P2qj27k9qJ7p%OPJ%J47j46
$$ 40 181 63 45 49 44 32 41 29 38 47 66 52 132 204 196 69 40 32 49 42 42 48 55 56 56 203 57
5692.00000144355E7oj0l%NMojMkK6rnMkj2J6kj1mJ0j8J5M8l0K1O6r8L5R
$$ 57 51 41 38 38 43 47 41 40 44 42 68 59 54 58 56 44 60 58 47 43 53 35 50 98 68 89 155 57 92 101
5632.00000022455A01O4R1M92n24M5K49O57M246m539k66K98O49P582q917L9
$$ 101 165 256 748 224 269 518 1175 5421 882 616 914 1563 9145 228 267
5602.00000025663B67O04N205n380r2K00O92P520p198r33m0j44J8R30j066r0
$$ 267 871 6076 696 604 804 1496 9016 1818 885 845 701 719 1649 583 493
5572.00000051326D93k1n0m5l4lj3j0K1p5oL6l7k8QLNk5L7k7j0k4J4J0j9J7
$$ 493 472 422 377 343 340 327 317 338 263 257 293 256 228 236 239 244 219 256 229 219 195 209 219 200 217
5522.00000109068B17l3L7L3K8j05L3K9N6J52J854j584q7J16O04J931J0136j2941
$$ 217 184 221 254 282 177 210 239 295 447 2301 717 630 746 1350 3281 13417 476
5488.00000006416D76j20K70O74K371n98p95J092r30j421j63L64Q05J1020j2153
$$ 476 356 626 1300 3671 3073 2278 3370 2440 1019 856 1220 2025 13045 892
5460.00000032079H92j50j53K16J408j127o36m9K7m6J8j03Qj9j7Jn0k1Kk4
$$ 892 742 589 805 2213 1086 450 401 428 382 400 297 305 286 269 270 220 199 201 177
5422.00000080197A77j9mk4J4ol4kMoj4k6K%lnk3JKLqj6K1%k4mJ6J23j17L0
$$ 177 158 154 130 144 138 104 102 106 100 86 60 62 62 59 54 31 32 34 37 29 13 34 34 10 6 22 145 28 58
5364.00000131523E8o3J1K0rJ17j05k1kK0k4RJ00j12K2l8J2Qj2QnJoJJKj
$$ 58 -5 6 26 17 134 29 8 6 26 2 11 111 -1 21 -17 -5 3 -9 -1 -6 -5 -11 -10 -9 -7 -8
5312.00000009624hJnjJ1kkj0MJ1j5lQmPKmjOj3KKKqJ1oNL8j8J9k2j1kjp
$$ -8 -7 -12 -13 -2 -4 -6 -16 -12 -1 -16 -19 -11 -15 -8 -6 -10 -11 -5 -18 -16 -14 -12 -20 -9 -15 -10 28 10 29 7 -4 -6 -7 -14
5244.00000048118a4J0kJ1J01p7k1Ok7OQj6RNkJ20j23PNj0Mj1o%J4Rj3j3j0
$$ -14 -4 -6 5 106 29 8 14 -13 -7 1 -15 -6 -1 -3 117 -6 1 6 -4 0 -11 -17 -17 -3 6 -7 -20 -30
5188.00000083405c0K4k0K6j5PpJ0k0J4jj1J6k2MJ1jkJJ6mrkRm%Rj6Rlmm
$$ -30 -6 -26 0 -15 -8 -15 -5 -25 -11 -12 -23 -7 -29 -25 -14 -15 -17 -16 0 -4 -13 -15 -6 -10 -10 -1 -17 -8 -11 -15 -19
5126.00000118692a9LlMJ3k1J8j0@
$$ -19 -16 -19 -15 -2 -23 -5 -15 0
$$ JDXCONVERT INTEGRAL FOLLOWS
$$ NOTE! INTEGRALS ARE NOT CONSISTENT WITH JCAMP-DX PROTOCOL (sorry!)

5163@@
5932@@
5932D025%JJ%T%J%J%VJKJJKKLJL%VJJKKKLLJKQKLKOJKLKLOKJLQKJKJ
$$ 4025 4025 4026 4027 4027 4027 4027 4028 4028 4029 4029 4029 4029 4029 4030 4032 4033 4034 4036 4038 4041 4042 4045 4045 4045 4045 4045 4046 4047 4049 4051 4053 4056 4059 4060 4062 4070 4072 4075 4077 4083 4084 4086 4089 4091 4094 4100 4102 4103 4106 4114 4116 4117 4119 4120
5824.00000051326D120KKJKJKKJ%JJJJJJJJKKJJ%JJJJJJ%JJKKJ%KJKKRLK
$$ 4120 4122 4124 4125 4127 4128 4130 4132 4133 4133 4134 4135 4136 4137 4138 4139 4140 4141 4143 4145 4146 4147 4147 4148 4149 4150 4151 4152 4153 4153 4154 4155 4157 4159 4160 4160 4162 4163 4165 4167 4176 4179 4181
5740.00000157186D181KLJKKJLLKPJ0J0LKJLKKKLLKJ0LLKKJLKKKKKLLLLK
$$ 4181 4183 4186 4187 4189 4191 4192 4195 4198 4200 4207 4217 4227 4230 4232 4233 4236 4238 4240 4242 4245 4248 4250 4260 4263 4266 4268 4270 4271 4274 4276 4278 4280 4282 4284 4287 4290 4293 4296 4298
5662.00000086613D298LLKLKKKLMMMQKNNQJ3L6J1J3K6N7K66M3L0M5P6M48J1
$$ 4298 4301 4304 4306 4309 4311 4313 4315 4318 4322 4326 4330 4338 4340 4345 4350 4358 4371 4407 4418 4431 4457 4514 4780 4823 4853 4898 4974 5422 5433
5604.00000019247E433J3M3K97L5K9L9P4M41Q9M4M1L4L5Q1K9K4K3K1J8J7J7
$$ 5433 5446 5489 5786 5821 5850 5889 5963 6404 6493 6537 6578 6612 6647 6728 6757 6781 6804 6825 6843 6860 6877
5562.00000083405F877J6J5J7J3J2J4J3J1J2J1J2J1J3J1J1RJ0J1J0J1RJ0J3
$$ 6877 6893 6908 6925 6938 6950 6964 6977 6988 7000 7011 7023 7034 7047 7058 7069 7078 7088 7099 7109 7120 7129 7139 7152
5516.00000128315G152J4QJ1J1J5K2J12L5L1L7O6J60O57K4J7L1O4J79J51J11
$$ 7152 7166 7174 7185 7196 7211 7233 7345 7380 7411 7448 7514 7674 8331 8355 8372 8403 8467 8646 8797 8908
5476.0000004491H908J65J20N0M2N9R9O39M4L6K9M0J08N3K2K0K1J8K0J5J4
$$ 8908 9073 9193 9243 9285 9344 9443 10082 10126 10162 10191 10231 10339 10392 10414 10434 10455 10473 10493 10508 10522
5436.00000035287A0522J4J4J3J1RJ0RQPPPONNONMLLLLKKJKKJ%KK%TJPJL
$$ 10522 10536 10550 10563 10574 10583 10593 10602 10610 10617 10624 10631 10637 10642 10647 10653 10658 10662 10665 10668 10671 10674 10676 10678 10679 10681 10683 10684 10684 10686 10688 10688 10688 10689 10696 10697 10700
5364.00000131523A0700%TJJPJ%TJ%TO%J%Z%Z%Z%T%
$$ 10700 10700 10700 10701 10702 10709 10710 10710 10710 10711 10711 10711 10717 10717 10718 10718 10718 10718 10718 10718 10718 10718 10718 10718 10718 10718 10718 10718 10718 10718 10718 10718 10718 10718 10718 10718 10718 10718 10718 10718 10718 10718
5282.0000010586A0718%Z%T%J%K%ZNJ%J%V%T%O%Z
$$ 10718 10718 10718 10718 10718 10718 10718 10718 10718 10718 10718 10718 10719 10719 10721 10721 10721 10721 10721 10721 10721 10721 10721 10726 10727 10727 10728 10728 10728 10728 10728 10728 10728 10728 10734 10734 10734 10734 10734 10734 10734 10734 10734
5198.00000051326A0734%Z%Z%Z%Z%Z%
$$ 10734 10734 10734 10734 10734 10734 10734 10734 10734 10734 10734 10734 10734 10734 10734 10734 10734 10734 10734 10734 10734 10734 10734 10734 10734 10734 10734 10734 10734 10734 10734 10734 10734 10734 10734 10734 10734 10734 10734 10734 10734 10734
5116.0000015077A0734%%
$$ 10734 10734 10734

##END=
